{"text_format":"1","workbook":"xlsx","n_sheets":5,"sheets":["Values","Worksheet","Answers","Working","Matrix"],"not_rendered":{"charts":0,"images":6,"macros":1,"external_links":0,"defined_names":0,"comments":0,"pivot_tables":0},"unopened":[],"bounds":{"document_bytes":16777216,"sheet_cells":100000,"rows_first":2000,"rows_last":500,"rows_between":2000,"halvings":0,"cell_chars":16384,"cell_head_chars":4096},"cells_cut":0,"cells_raw":0,"read":"whole","date_system":"1900"}

{"sheet":"Values","index":0,"n_rows":21,"n_cols":9,"rows_kept":21,"cut":false,"hidden":false,"merged":[[18,2,18,6],[18,8,22,9],[20,2,23,7],[3,2,3,6],[5,2,6,7],[17,2,17,7],[12,2,12,6]]}
[null,null,null,null,"ADDITION & SUBTRACTION OF FRACTIONS"]
[null,null,null,null,"Simplified Answers"]
[]
[null,null,"INSTRUCTIONS"]
[]
[null,"Step 1","Click to select the denominators to be used for this sheet."]
[]
[null,null,null,null,null,null,null,null,"Infomormation"]
[null,null,null,null,null,null,null,null,"* These questions are generated from a list of all"]
[null,null,null,null,null,null,null,null,"  possible questions. This may result in some repetition"]
[null,null,null,null,null,null,null,null,"* Answers include working steps."]
[null,null,null,null,null,null,null,null,"* Some answers could be 1"]
[null,"Step 2","Click to select the type of operation."]
[]
[]
[]
[]
[]
[null,"Step 3","Click on WorkSheet tab below.",null,null,null,null,null,"PRESS F9 for NEW WorkSheet"]
[]
{"$rows_left_out":2}
{"sheet":"Worksheet","index":1,"n_rows":49,"n_cols":20,"rows_kept":49,"cut":false,"hidden":false,"merged":[]}
[null,null,null,null,null,null,null,null,{"$f":"Working!M1","v":"ADDITION & SUBTRACTION OF FRACTIONS"}]
[null,null,null,null,null,null,null,null,null,null,null,null,null,null,null,null,null,null,null,{"$f":" CONCATENATE(\"Worksheet \",Working!J1,Working!H1)","v":"Worksheet AFS - 489"}]
["Simplify the following;"]
[{"$f":" Working!B4","v":1},{"$f":" Working!AA4","v":1},{"$f":"Working!$Z4","v":" + "},{"$f":" Working!AC4","v":3},{"$f":" Working!B14","v":6},{"$f":" Working!AA14","v":4},{"$f":"Working!Z14","v":" - "},{"$f":" Working!AC14","v":1},{"$f":" Working!B24","v":11},{"$f":" Working!AA24","v":1},{"$f":"Working!Z24","v":" + "},{"$f":" Working!AC24","v":9},{"$f":" Working!B34","v":16},{"$f":" Working!AA34","v":3},{"$f":"Working!Z34","v":" - "},{"$f":" Working!AC34","v":1},{"$f":" Working!B44","v":21},{"$f":" Working!AA44","v":3},{"$f":"Working!Z44","v":" - "},{"$f":" Working!AC44","v":1}]
[null,{"$f":" Working!AA5","v":2},null,{"$f":" Working!AC5","v":10},null,{"$f":" Working!AA15","v":5},null,{"$f":" Working!AC15","v":6},null,{"$f":" Working!AA25","v":10},null,{"$f":" Working!AC25","v":10},null,{"$f":" Working!AA35","v":4},null,{"$f":" Working!AC35","v":6},null,{"$f":" Working!AA45","v":10},null,{"$f":" Working!AC45","v":5}]
[]
[]
[]
[]
[]
[]
[]
[]
[]
[{"$f":"Working!B6","v":2},{"$f":"Working!AA6","v":1},{"$f":"Working!$Z6","v":" + "},{"$f":"Working!AC6","v":1},{"$f":"Working!B16","v":7},{"$f":"Working!AA16","v":5},{"$f":"Working!$Z16","v":" - "},{"$f":"Working!AC16","v":1},{"$f":"Working!B26","v":12},{"$f":"Working!AA26","v":1},{"$f":"Working!$Z26","v":" + "},{"$f":"Working!AC26","v":4},{"$f":"Working!B36","v":17},{"$f":"Working!AA36","v":1},{"$f":"Working!$Z36","v":" + "},{"$f":"Working!AC36","v":2},{"$f":"Working!B46","v":22},{"$f":"Working!AA46","v":9},{"$f":"Working!$Z46","v":" - "},{"$f":"Working!AC46","v":1}]
[null,{"$f":"Working!AA7","v":10},null,{"$f":"Working!AC7","v":5},null,{"$f":"Working!AA17","v":8},null,{"$f":"Working!AC17","v":3},null,{"$f":"Working!AA27","v":5},null,{"$f":"Working!AC27","v":5},null,{"$f":"Working!AA37","v":10},null,{"$f":"Working!AC37","v":5},null,{"$f":"Working!AA47","v":10},null,{"$f":"Working!AC47","v":10}]
[]
[]
[]
[]
{"$rows_left_out":30}
{"sheet":"Answers","index":2,"n_rows":55,"n_cols":20,"rows_kept":55,"cut":false,"hidden":false,"merged":[]}
[null,null,null,null,null,null,null,null,{"$f":"Working!M1","v":"ADDITION & SUBTRACTION OF FRACTIONS"}]
[null,null,null,null,null,null,null,null,"Solutions",null,null,null,null,null,null,null,null,null,null,{"$f":" CONCATENATE(\"Worksheet \",Working!J1,Working!H1)","v":"Worksheet AFS - 489"}]
["Simplify the following;"]
[{"$f":" Working!B4","v":1},{"$f":" Working!AA4","v":1},{"$f":"Working!$Z4","v":" + "},{"$f":" Working!AC4","v":3},{"$f":" Working!B14","v":6},{"$f":" Working!AA14","v":4},{"$f":"Working!Z14","v":" - "},{"$f":" Working!AC14","v":1},{"$f":" Working!B24","v":11},{"$f":" Working!AA24","v":1},{"$f":"Working!Z24","v":" + "},{"$f":" Working!AC24","v":9},{"$f":" Working!B34","v":16},{"$f":" Working!AA34","v":3},{"$f":"Working!Z34","v":" - "},{"$f":" Working!AC34","v":1},{"$f":" Working!B44","v":21},{"$f":" Working!AA44","v":3},{"$f":"Working!Z44","v":" - "},{"$f":" Working!AC44","v":1}]
[null,{"$f":" Working!AA5","v":2},null,{"$f":" Working!AC5","v":10},null,{"$f":" Working!AA15","v":5},null,{"$f":" Working!AC15","v":6},null,{"$f":" Working!AA25","v":10},null,{"$f":" Working!AC25","v":10},null,{"$f":" Working!AA35","v":4},null,{"$f":" Working!AC35","v":6},null,{"$f":" Working!AA45","v":10},null,{"$f":" Working!AC45","v":5}]
["=",{"$f":"Working!$AE4","v":10},{"$f":"Working!$Z4","v":" + "},{"$f":"Working!$AG4","v":6},"=",{"$f":"Working!$AE14","v":24},{"$f":"Working!Z14","v":" - "},{"$f":"Working!$AG14","v":5},"=",{"$f":"Working!$AE24","v":10},{"$f":"Working!Z24","v":" + "},{"$f":"Working!$AG24","v":90},"=",{"$f":"Working!$AE34","v":18},{"$f":"Working!Z34","v":" - "},{"$f":"Working!$AG34","v":4},"=",{"$f":"Working!$AE44","v":15},{"$f":"Working!Z44","v":" - "},{"$f":"Working!$AG44","v":10}]
[null,{"$f":"Working!$AE5","v":10},null,{"$f":"Working!$AG5","v":20},null,{"$f":"Working!$AE15","v":30},null,{"$f":"Working!$AG15","v":30},null,{"$f":"Working!$AE25","v":10},null,{"$f":"Working!$AG25","v":100},null,{"$f":"Working!$AE35","v":24},null,{"$f":"Working!$AG35","v":24},null,{"$f":"Working!$AE45","v":50},null,{"$f":"Working!$AG45","v":50}]
["=",{"$f":"Working!$AI4","v":16},null,null,"=",{"$f":"Working!$AI14","v":19},null,null,"=",{"$f":"Working!$AI24","v":100},null,null,"=",{"$f":"Working!$AI34","v":14},null,null,"=",{"$f":"Working!$AI44","v":5}]
[null,{"$f":"Working!$AI5","v":20},null,null,null,{"$f":"Working!$AI15","v":30},null,null,null,{"$f":"Working!$AI25","v":100},null,null,null,{"$f":"Working!$AI35","v":24},null,null,null,{"$f":"Working!$AI45","v":50}]
[{"$f":"IF(B10=\"\",\"\",\"=\")","v":"="},{"$f":"IF(Working!AO4=B8,\"\",Working!AO4)","v":4},null,null,{"$f":"IF(F10=\"\",\"\",\"=\")","v":""},{"$f":"IF(Working!AO14=F8,\"\",Working!AO14)","v":""},null,null,{"$f":"IF(J10=\"\",\"\",\"=\")","v":"="},{"$f":"IF(Working!AO24=J8,\"\",Working!AO24)","v":1},null,null,{"$f":"IF(N10=\"\",\"\",\"=\")","v":"="},{"$f":"IF(Working!AO34=N8,\"\",Working!AO34)","v":7},null,null,{"$f":"IF(R10=\"\",\"\",\"=\")","v":"="},{"$f":"IF(Working!AO44=R8,\"\",Working!AO44)","v":1}]
[null,{"$f":"IF(Working!AP4=B9,\"\",Working!AP4)","v":5},null,null,null,{"$f":"IF(Working!AP14=F9,\"\",Working!AP14)","v":""},null,null,null,{"$f":"IF(Working!AP24=J9,\"\",Working!AP24)","v":""},null,null,null,{"$f":"IF(Working!AP34=N9,\"\",Working!AP34)","v":12},null,null,null,{"$f":"IF(Working!AP44=R9,\"\",Working!AP44)","v":10}]
[]
[]
[]
[{"$f":"Working!B6","v":2},{"$f":"Working!AA6","v":1},{"$f":"Working!$Z6","v":" + "},{"$f":"Working!AC6","v":1},{"$f":"Working!B16","v":7},{"$f":"Working!AA16","v":5},{"$f":"Working!$Z16","v":" - "},{"$f":"Working!AC16","v":1},{"$f":"Working!B26","v":12},{"$f":"Working!AA26","v":1},{"$f":"Working!$Z26","v":" + "},{"$f":"Working!AC26","v":4},{"$f":"Working!B36","v":17},{"$f":"Working!AA36","v":1},{"$f":"Working!$Z36","v":" + "},{"$f":"Working!AC36","v":2},{"$f":"Working!B46","v":22},{"$f":"Working!AA46","v":9},{"$f":"Working!$Z46","v":" - "},{"$f":"Working!AC46","v":1}]
[null,{"$f":"Working!AA7","v":10},null,{"$f":"Working!AC7","v":5},null,{"$f":"Working!AA17","v":8},null,{"$f":"Working!AC17","v":3},null,{"$f":"Working!AA27","v":5},null,{"$f":"Working!AC27","v":5},null,{"$f":"Working!AA37","v":10},null,{"$f":"Working!AC37","v":5},null,{"$f":"Working!AA47","v":10},null,{"$f":"Working!AC47","v":10}]
["=",{"$f":"Working!$AE6","v":5},{"$f":"Working!$Z6","v":" + "},{"$f":"Working!$AG6","v":10},"=",{"$f":"Working!$AE16","v":15},{"$f":"Working!$Z16","v":" - "},{"$f":"Working!$AG16","v":8},"=",{"$f":"Working!$AE26","v":5},{"$f":"Working!$Z26","v":" + "},{"$f":"Working!$AG26","v":20},"=",{"$f":"Working!$AE36","v":5},{"$f":"Working!$Z36","v":" + "},{"$f":"Working!$AG36","v":20},"=",{"$f":"Working!$AE46","v":90},{"$f":"Working!$Z46","v":" - "},{"$f":"Working!$AG46","v":10}]
[null,{"$f":"Working!$AE7","v":10},null,{"$f":"Working!$AG7","v":50},null,{"$f":"Working!$AE17","v":24},null,{"$f":"Working!$AG17","v":24},null,{"$f":"Working!$AE27","v":5},null,{"$f":"Working!$AG27","v":25},null,{"$f":"Working!$AE37","v":10},null,{"$f":"Working!$AG37","v":50},null,{"$f":"Working!$AE47","v":100},null,{"$f":"Working!$AG47","v":100}]
["=",{"$f":"Working!$AI6","v":15},null,null,"=",{"$f":"Working!$AI16","v":7},null,null,"=",{"$f":"Working!$AI26","v":25},null,null,"=",{"$f":"Working!$AI36","v":25},null,null,"=",{"$f":"Working!$AI46","v":80}]
[null,{"$f":"Working!$AI7","v":50},null,null,null,{"$f":"Working!$AI17","v":24},null,null,null,{"$f":"Working!$AI27","v":25},null,null,null,{"$f":"Working!$AI37","v":50},null,null,null,{"$f":"Working!$AI47","v":100}]
{"$rows_left_out":36}
{"sheet":"Working","index":3,"n_rows":62,"n_cols":46,"rows_kept":62,"cut":false,"hidden":true,"merged":[]}
[{"$f":"INT(900*RAND()+100)","v":489},null,null,null,null,null,null,{"$f":"TEXT(A1,0)","v":"489"},null,"AFS - ",null,null,"ADDITION & SUBTRACTION OF FRACTIONS",null,null,null,null,null,null,null,null,null,null,null,2]
[]
[null,null,null,null,"a","b","c","d",null,"Subtraction"]
[null,1,{"$f":"IF($Y$1=3,\"2478\",IF($Y$1=2,\"111\",\"73\"))","v":"111"},{"$f":"RANDBETWEEN(1,C4)","v":7},{"$f":"LOOKUP(D4,Matrix!$A$4:$B$2481)","v":1},{"$f":"LOOKUP(D4,Matrix!$A$4:$C$2481)","v":2},{"$f":"LOOKUP(D4,Matrix!$A$4:$D$2481)","v":3},{"$f":"LOOKUP(D4,Matrix!$A$4:$E$2481)","v":10},null,{"$f":"E4","v":1},{"$f":"G4","v":3},{"$f":"E4*H4","v":10},{"$f":"G4*F4","v":6},{"$f":"IF(M4>L4,K4,J4)","v":1},{"$f":"IF(M4>L4,J4,K4)","v":3},{"$f":"IF(M4>L4,M4,L4)","v":10},{"$f":"IF(M4>L4,L4,M4)","v":6},{"$f":"P4-Q4","v":4},null,1,{"$f":"R4/T4","v":4},null,null,null,{"$f":"INT(2*RAND())","v":0},{"$f":"IF(Y4=0,\" + \",\" - \")","v":" + "},{"$f":"IF($Y4=1,N4,J4)","v":1},{"$f":"Z4","v":" + "},{"$f":"IF($Y4=1,O4,K4)","v":3},"=",{"$f":"IF($Y4=1,P4,L4)","v":10},{"$f":"Z4","v":" + "},{"$f":"IF($Y4=1,Q4,M4)","v":6},"=",{"$f":"IF($Y4=1,R4,L4+M4)","v":16},null,null,{"$f":"GCD(AI4,AI5)","v":4},{"$f":"AI4/AL4","v":4},null,{"$f":"AM4","v":4},{"$f":"IF(AND(AM4=1,AM5=1),\"\",AM5)","v":5},null,{"$f":"CONCATENATE(AI4,\"/\",AI5)","v":"16/20"},"=",{"$f":"CONCATENATE(AM4,\"/\",AM5)","v":"4/5"}]
[null,null,null,null,null,null,null,null,null,{"$f":"F4","v":2},{"$f":"H4","v":10},{"$f":"F4*H4","v":20},{"$f":"F4*H4","v":20},{"$f":"IF(M4>L4,K5,J5)","v":2},{"$f":"IF(M4>L4,J5,K5)","v":10},{"$f":"L5","v":20},{"$f":"M5","v":20},{"$f":"Q5","v":20},null,1,{"$f":"R5/T4","v":20},null,null,null,0,null,{"$f":"IF($Y4=1,N5,J5)","v":2},null,{"$f":"IF($Y4=1,O5,K5)","v":10},null,{"$f":"IF($Y4=1,Q5,O5)","v":10},null,{"$f":"IF($Y4=1,Q5,M5)","v":20},null,{"$f":"IF($Y4=1,R5,P5)","v":20},null,null,null,{"$f":"AI5/AL4","v":5}]
[null,2,{"$f":"IF($Y$1=3,\"2478\",IF($Y$1=2,\"111\",\"73\"))","v":"111"},{"$f":"RANDBETWEEN(1,C6)","v":47},{"$f":"LOOKUP(D6,Matrix!$A$4:$B$2481)","v":1},{"$f":"LOOKUP(D6,Matrix!$A$4:$C$2481)","v":10},{"$f":"LOOKUP(D6,Matrix!$A$4:$D$2481)","v":1},{"$f":"LOOKUP(D6,Matrix!$A$4:$E$2481)","v":5},null,{"$f":"E6","v":1},{"$f":"G6","v":1},{"$f":"E6*H6","v":5},{"$f":"G6*F6","v":10},{"$f":"IF(M6>L6,K6,J6)","v":1},{"$f":"IF(M6>L6,J6,K6)","v":1},{"$f":"IF(M6>L6,M6,L6)","v":10},{"$f":"IF(M6>L6,L6,M6)","v":5},{"$f":"P6-Q6","v":5},null,1,{"$f":"R6/T6","v":5},null,null,null,0,{"$f":"IF(Y6=0,\" + \",\" - \")","v":" + "},{"$f":"IF($Y6=1,N6,J6)","v":1},{"$f":"Z6","v":" + "},{"$f":"IF($Y6=1,O6,K6)","v":1},"=",{"$f":"IF($Y6=1,P6,L6)","v":5},{"$f":"Z6","v":" + "},{"$f":"IF($Y6=1,Q6,M6)","v":10},"=",{"$f":"IF($Y6=1,R6,L6+M6)","v":15},null,null,{"$f":"GCD(AI6,AI7)","v":5},{"$f":"AI6/AL6","v":3},null,{"$f":"AM6","v":3},{"$f":"IF(AND(AM6=1,AM7=1),\"\",AM7)","v":10},null,{"$f":"CONCATENATE(AI6,\"/\",AI7)","v":"15/50"},"=",{"$f":"CONCATENATE(AM6,\"/\",AM7)","v":"3/10"}]
[null,null,null,null,null,null,null,null,null,{"$f":"F6","v":10},{"$f":"H6","v":5},{"$f":"F6*H6","v":50},{"$f":"F6*H6","v":50},{"$f":"IF(M6>L6,K7,J7)","v":5},{"$f":"IF(M6>L6,J7,K7)","v":10},{"$f":"L7","v":50},{"$f":"M7","v":50},{"$f":"Q7","v":50},null,1,{"$f":"R7/T6","v":50},null,null,null,1,null,{"$f":"IF($Y6=1,N7,J7)","v":10},null,{"$f":"IF($Y6=1,O7,K7)","v":5},null,{"$f":"IF($Y6=1,Q7,O7)","v":10},null,{"$f":"IF($Y6=1,Q7,M7)","v":50},null,{"$f":"IF($Y6=1,R7,P7)","v":50},null,null,null,{"$f":"AI7/AL6","v":10}]
[null,3,{"$f":"IF($Y$1=3,\"2478\",IF($Y$1=2,\"111\",\"73\"))","v":"111"},109,{"$f":"LOOKUP(D8,Matrix!$A$4:$B$2481)","v":5},{"$f":"LOOKUP(D8,Matrix!$A$4:$C$2481)","v":6},{"$f":"LOOKUP(D8,Matrix!$A$4:$D$2481)","v":1},{"$f":"LOOKUP(D8,Matrix!$A$4:$E$2481)","v":6},null,{"$f":"E8","v":5},{"$f":"G8","v":1},{"$f":"E8*H8","v":30},{"$f":"G8*F8","v":6},{"$f":"IF(M8>L8,K8,J8)","v":5},{"$f":"IF(M8>L8,J8,K8)","v":1},{"$f":"IF(M8>L8,M8,L8)","v":30},{"$f":"IF(M8>L8,L8,M8)","v":6},{"$f":"P8-Q8","v":24},null,1,{"$f":"R8/T8","v":24},null,null,null,0,{"$f":"IF(Y8=0,\" + \",\" - \")","v":" + "},{"$f":"IF($Y8=1,N8,J8)","v":5},{"$f":"Z8","v":" + "},{"$f":"IF($Y8=1,O8,K8)","v":1},"=",{"$f":"IF($Y8=1,P8,L8)","v":30},{"$f":"Z8","v":" + "},{"$f":"IF($Y8=1,Q8,M8)","v":6},"=",{"$f":"IF($Y8=1,R8,L8+M8)","v":36},null,null,{"$f":"GCD(AI8,AI9)","v":36},{"$f":"AI8/AL8","v":1},null,{"$f":"AM8","v":1},{"$f":"IF(AND(AM8=1,AM9=1),\"\",AM9)","v":""},null,{"$f":"CONCATENATE(AI8,\"/\",AI9)","v":"36/36"},"=",{"$f":"CONCATENATE(AM8,\"/\",AM9)","v":"1/1"}]
[null,null,null,null,null,null,null,null,null,{"$f":"F8","v":6},{"$f":"H8","v":6},{"$f":"F8*H8","v":36},{"$f":"F8*H8","v":36},{"$f":"IF(M8>L8,K9,J9)","v":6},{"$f":"IF(M8>L8,J9,K9)","v":6},{"$f":"L9","v":36},{"$f":"M9","v":36},{"$f":"Q9","v":36},null,1,{"$f":"R9/T8","v":36},null,null,null,0,null,{"$f":"IF($Y8=1,N9,J9)","v":6},null,{"$f":"IF($Y8=1,O9,K9)","v":6},null,{"$f":"IF($Y8=1,Q9,O9)","v":6},null,{"$f":"IF($Y8=1,Q9,M9)","v":36},null,{"$f":"IF($Y8=1,R9,P9)","v":36},null,null,null,{"$f":"AI9/AL8","v":1}]
[null,4,{"$f":"IF($Y$1=3,\"2478\",IF($Y$1=2,\"111\",\"73\"))","v":"111"},88,{"$f":"LOOKUP(D10,Matrix!$A$4:$B$2481)","v":2},{"$f":"LOOKUP(D10,Matrix!$A$4:$C$2481)","v":3},{"$f":"LOOKUP(D10,Matrix!$A$4:$D$2481)","v":1},{"$f":"LOOKUP(D10,Matrix!$A$4:$E$2481)","v":5},null,{"$f":"E10","v":2},{"$f":"G10","v":1},{"$f":"E10*H10","v":10},{"$f":"G10*F10","v":3},{"$f":"IF(M10>L10,K10,J10)","v":2},{"$f":"IF(M10>L10,J10,K10)","v":1},{"$f":"IF(M10>L10,M10,L10)","v":10},{"$f":"IF(M10>L10,L10,M10)","v":3},{"$f":"P10-Q10","v":7},null,1,{"$f":"R10/T10","v":7},null,null,null,0,{"$f":"IF(Y10=0,\" + \",\" - \")","v":" + "},{"$f":"IF($Y10=1,N10,J10)","v":2},{"$f":"Z10","v":" + "},{"$f":"IF($Y10=1,O10,K10)","v":1},"=",{"$f":"IF($Y10=1,P10,L10)","v":10},{"$f":"Z10","v":" + "},{"$f":"IF($Y10=1,Q10,M10)","v":3},"=",{"$f":"IF($Y10=1,R10,L10+M10)","v":13},null,null,{"$f":"GCD(AI10,AI11)","v":1},{"$f":"AI10/AL10","v":13},null,{"$f":"AM10","v":13},{"$f":"IF(AND(AM10=1,AM11=1),\"\",AM11)","v":15},null,{"$f":"CONCATENATE(AI10,\"/\",AI11)","v":"13/15"},"=",{"$f":"CONCATENATE(AM10,\"/\",AM11)","v":"13/15"}]
[null,null,null,null,null,null,null,null,null,{"$f":"F10","v":3},{"$f":"H10","v":5},{"$f":"F10*H10","v":15},{"$f":"F10*H10","v":15},{"$f":"IF(M10>L10,K11,J11)","v":3},{"$f":"IF(M10>L10,J11,K11)","v":5},{"$f":"L11","v":15},{"$f":"M11","v":15},{"$f":"Q11","v":15},null,1,{"$f":"R11/T10","v":15},null,null,null,1,null,{"$f":"IF($Y10=1,N11,J11)","v":3},null,{"$f":"IF($Y10=1,O11,K11)","v":5},null,{"$f":"IF($Y10=1,Q11,O11)","v":5},null,{"$f":"IF($Y10=1,Q11,M11)","v":15},null,{"$f":"IF($Y10=1,R11,P11)","v":15},null,null,null,{"$f":"AI11/AL10","v":15}]
[null,5,{"$f":"IF($Y$1=3,\"2478\",IF($Y$1=2,\"111\",\"73\"))","v":"111"},109,{"$f":"LOOKUP(D12,Matrix!$A$4:$B$2481)","v":5},{"$f":"LOOKUP(D12,Matrix!$A$4:$C$2481)","v":6},{"$f":"LOOKUP(D12,Matrix!$A$4:$D$2481)","v":1},{"$f":"LOOKUP(D12,Matrix!$A$4:$E$2481)","v":6},null,{"$f":"E12","v":5},{"$f":"G12","v":1},{"$f":"E12*H12","v":30},{"$f":"G12*F12","v":6},{"$f":"IF(M12>L12,K12,J12)","v":5},{"$f":"IF(M12>L12,J12,K12)","v":1},{"$f":"IF(M12>L12,M12,L12)","v":30},{"$f":"IF(M12>L12,L12,M12)","v":6},{"$f":"P12-Q12","v":24},null,1,{"$f":"R12/T12","v":24},null,null,null,0,{"$f":"IF(Y12=0,\" + \",\" - \")","v":" + "},{"$f":"IF($Y12=1,N12,J12)","v":5},{"$f":"Z12","v":" + "},{"$f":"IF($Y12=1,O12,K12)","v":1},"=",{"$f":"IF($Y12=1,P12,L12)","v":30},{"$f":"Z12","v":" + "},{"$f":"IF($Y12=1,Q12,M12)","v":6},"=",{"$f":"IF($Y12=1,R12,L12+M12)","v":36},null,null,{"$f":"GCD(AI12,AI13)","v":36},{"$f":"AI12/AL12","v":1},null,{"$f":"AM12","v":1},{"$f":"IF(AND(AM12=1,AM13=1),\"\",AM13)","v":""},null,{"$f":"CONCATENATE(AI12,\"/\",AI13)","v":"36/36"},"=",{"$f":"CONCATENATE(AM12,\"/\",AM13)","v":"1/1"}]
[null,null,null,null,null,null,null,null,null,{"$f":"F12","v":6},{"$f":"H12","v":6},{"$f":"F12*H12","v":36},{"$f":"F12*H12","v":36},{"$f":"IF(M12>L12,K13,J13)","v":6},{"$f":"IF(M12>L12,J13,K13)","v":6},{"$f":"L13","v":36},{"$f":"M13","v":36},{"$f":"Q13","v":36},null,1,{"$f":"R13/T12","v":36},null,null,null,1,null,{"$f":"IF($Y12=1,N13,J13)","v":6},null,{"$f":"IF($Y12=1,O13,K13)","v":6},null,{"$f":"IF($Y12=1,Q13,O13)","v":6},null,{"$f":"IF($Y12=1,Q13,M13)","v":36},null,{"$f":"IF($Y12=1,R13,P13)","v":36},null,null,null,{"$f":"AI13/AL12","v":1}]
[null,6,{"$f":"IF($Y$1=3,\"2478\",IF($Y$1=2,\"111\",\"73\"))","v":"111"},101,{"$f":"LOOKUP(D14,Matrix!$A$4:$B$2481)","v":1},{"$f":"LOOKUP(D14,Matrix!$A$4:$C$2481)","v":6},{"$f":"LOOKUP(D14,Matrix!$A$4:$D$2481)","v":4},{"$f":"LOOKUP(D14,Matrix!$A$4:$E$2481)","v":5},null,{"$f":"E14","v":1},{"$f":"G14","v":4},{"$f":"E14*H14","v":5},{"$f":"G14*F14","v":24},{"$f":"IF(M14>L14,K14,J14)","v":4},{"$f":"IF(M14>L14,J14,K14)","v":1},{"$f":"IF(M14>L14,M14,L14)","v":24},{"$f":"IF(M14>L14,L14,M14)","v":5},{"$f":"P14-Q14","v":19},null,1,{"$f":"R14/T14","v":19},null,null,null,1,{"$f":"IF(Y14=0,\" + \",\" - \")","v":" - "},{"$f":"IF($Y14=1,N14,J14)","v":4},{"$f":"Z14","v":" - "},{"$f":"IF($Y14=1,O14,K14)","v":1},"=",{"$f":"IF($Y14=1,P14,L14)","v":24},{"$f":"Z14","v":" - "},{"$f":"IF($Y14=1,Q14,M14)","v":5},"=",{"$f":"IF($Y14=1,R14,L14+M14)","v":19},null,null,{"$f":"GCD(AI14,AI15)","v":1},{"$f":"AI14/AL14","v":19},null,{"$f":"AM14","v":19},{"$f":"IF(AND(AM14=1,AM15=1),\"\",AM15)","v":30},null,{"$f":"CONCATENATE(AI14,\"/\",AI15)","v":"19/30"},"=",{"$f":"CONCATENATE(AM14,\"/\",AM15)","v":"19/30"}]
[null,null,null,null,null,null,null,null,null,{"$f":"F14","v":6},{"$f":"H14","v":5},{"$f":"F14*H14","v":30},{"$f":"F14*H14","v":30},{"$f":"IF(M14>L14,K15,J15)","v":5},{"$f":"IF(M14>L14,J15,K15)","v":6},{"$f":"L15","v":30},{"$f":"M15","v":30},{"$f":"Q15","v":30},null,1,{"$f":"R15/T14","v":30},null,null,null,1,null,{"$f":"IF($Y14=1,N15,J15)","v":5},null,{"$f":"IF($Y14=1,O15,K15)","v":6},null,{"$f":"IF($Y14=1,Q15,O15)","v":30},null,{"$f":"IF($Y14=1,Q15,M15)","v":30},null,{"$f":"IF($Y14=1,R15,P15)","v":30},null,null,null,{"$f":"AI15/AL14","v":30}]
[null,7,{"$f":"IF($Y$1=3,\"2478\",IF($Y$1=2,\"111\",\"73\"))","v":"111"},83,{"$f":"LOOKUP(D16,Matrix!$A$4:$B$2481)","v":1},{"$f":"LOOKUP(D16,Matrix!$A$4:$C$2481)","v":3},{"$f":"LOOKUP(D16,Matrix!$A$4:$D$2481)","v":5},{"$f":"LOOKUP(D16,Matrix!$A$4:$E$2481)","v":8},null,{"$f":"E16","v":1},{"$f":"G16","v":5},{"$f":"E16*H16","v":8},{"$f":"G16*F16","v":15},{"$f":"IF(M16>L16,K16,J16)","v":5},{"$f":"IF(M16>L16,J16,K16)","v":1},{"$f":"IF(M16>L16,M16,L16)","v":15},{"$f":"IF(M16>L16,L16,M16)","v":8},{"$f":"P16-Q16","v":7},null,1,{"$f":"R16/T16","v":7},null,null,null,1,{"$f":"IF(Y16=0,\" + \",\" - \")","v":" - "},{"$f":"IF($Y16=1,N16,J16)","v":5},{"$f":"Z16","v":" - "},{"$f":"IF($Y16=1,O16,K16)","v":1},"=",{"$f":"IF($Y16=1,P16,L16)","v":15},{"$f":"Z16","v":" - "},{"$f":"IF($Y16=1,Q16,M16)","v":8},"=",{"$f":"IF($Y16=1,R16,L16+M16)","v":7},null,null,{"$f":"GCD(AI16,AI17)","v":1},{"$f":"AI16/AL16","v":7},null,{"$f":"AM16","v":7},{"$f":"IF(AND(AM16=1,AM17=1),\"\",AM17)","v":24},null,{"$f":"CONCATENATE(AI16,\"/\",AI17)","v":"7/24"},"=",{"$f":"CONCATENATE(AM16,\"/\",AM17)","v":"7/24"}]
[null,null,null,null,null,null,null,null,null,{"$f":"F16","v":3},{"$f":"H16","v":8},{"$f":"F16*H16","v":24},{"$f":"F16*H16","v":24},{"$f":"IF(M16>L16,K17,J17)","v":8},{"$f":"IF(M16>L16,J17,K17)","v":3},{"$f":"L17","v":24},{"$f":"M17","v":24},{"$f":"Q17","v":24},null,1,{"$f":"R17/T16","v":24},null,null,null,0,null,{"$f":"IF($Y16=1,N17,J17)","v":8},null,{"$f":"IF($Y16=1,O17,K17)","v":3},null,{"$f":"IF($Y16=1,Q17,O17)","v":24},null,{"$f":"IF($Y16=1,Q17,M17)","v":24},null,{"$f":"IF($Y16=1,R17,P17)","v":24},null,null,null,{"$f":"AI17/AL16","v":24}]
[null,8,{"$f":"IF($Y$1=3,\"2478\",IF($Y$1=2,\"111\",\"73\"))","v":"111"},64,{"$f":"LOOKUP(D18,Matrix!$A$4:$B$2481)","v":3},{"$f":"LOOKUP(D18,Matrix!$A$4:$C$2481)","v":10},{"$f":"LOOKUP(D18,Matrix!$A$4:$D$2481)","v":3},{"$f":"LOOKUP(D18,Matrix!$A$4:$E$2481)","v":8},null,{"$f":"E18","v":3},{"$f":"G18","v":3},{"$f":"E18*H18","v":24},{"$f":"G18*F18","v":30},{"$f":"IF(M18>L18,K18,J18)","v":3},{"$f":"IF(M18>L18,J18,K18)","v":3},{"$f":"IF(M18>L18,M18,L18)","v":30},{"$f":"IF(M18>L18,L18,M18)","v":24},{"$f":"P18-Q18","v":6},null,1,{"$f":"R18/T18","v":6},null,null,null,1,{"$f":"IF(Y18=0,\" + \",\" - \")","v":" - "},{"$f":"IF($Y18=1,N18,J18)","v":3},{"$f":"Z18","v":" - "},{"$f":"IF($Y18=1,O18,K18)","v":3},"=",{"$f":"IF($Y18=1,P18,L18)","v":30},{"$f":"Z18","v":" - "},{"$f":"IF($Y18=1,Q18,M18)","v":24},"=",{"$f":"IF($Y18=1,R18,L18+M18)","v":6},null,null,{"$f":"GCD(AI18,AI19)","v":2},{"$f":"AI18/AL18","v":3},null,{"$f":"AM18","v":3},{"$f":"IF(AND(AM18=1,AM19=1),\"\",AM19)","v":40},null,{"$f":"CONCATENATE(AI18,\"/\",AI19)","v":"6/80"},"=",{"$f":"CONCATENATE(AM18,\"/\",AM19)","v":"3/40"}]
[null,null,null,null,null,null,null,null,null,{"$f":"F18","v":10},{"$f":"H18","v":8},{"$f":"F18*H18","v":80},{"$f":"F18*H18","v":80},{"$f":"IF(M18>L18,K19,J19)","v":8},{"$f":"IF(M18>L18,J19,K19)","v":10},{"$f":"L19","v":80},{"$f":"M19","v":80},{"$f":"Q19","v":80},null,1,{"$f":"R19/T18","v":80},null,null,null,1,null,{"$f":"IF($Y18=1,N19,J19)","v":8},null,{"$f":"IF($Y18=1,O19,K19)","v":10},null,{"$f":"IF($Y18=1,Q19,O19)","v":80},null,{"$f":"IF($Y18=1,Q19,M19)","v":80},null,{"$f":"IF($Y18=1,R19,P19)","v":80},null,null,null,{"$f":"AI19/AL18","v":40}]
[null,9,{"$f":"IF($Y$1=3,\"2478\",IF($Y$1=2,\"111\",\"73\"))","v":"111"},26,{"$f":"LOOKUP(D20,Matrix!$A$4:$B$2481)","v":1},{"$f":"LOOKUP(D20,Matrix!$A$4:$C$2481)","v":5},{"$f":"LOOKUP(D20,Matrix!$A$4:$D$2481)","v":3},{"$f":"LOOKUP(D20,Matrix!$A$4:$E$2481)","v":5},null,{"$f":"E20","v":1},{"$f":"G20","v":3},{"$f":"E20*H20","v":5},{"$f":"G20*F20","v":15},{"$f":"IF(M20>L20,K20,J20)","v":3},{"$f":"IF(M20>L20,J20,K20)","v":1},{"$f":"IF(M20>L20,M20,L20)","v":15},{"$f":"IF(M20>L20,L20,M20)","v":5},{"$f":"P20-Q20","v":10},null,1,{"$f":"R20/T20","v":10},null,null,null,1,{"$f":"IF(Y20=0,\" + \",\" - \")","v":" - "},{"$f":"IF($Y20=1,N20,J20)","v":3},{"$f":"Z20","v":" - "},{"$f":"IF($Y20=1,O20,K20)","v":1},"=",{"$f":"IF($Y20=1,P20,L20)","v":15},{"$f":"Z20","v":" - "},{"$f":"IF($Y20=1,Q20,M20)","v":5},"=",{"$f":"IF($Y20=1,R20,L20+M20)","v":10},null,null,{"$f":"GCD(AI20,AI21)","v":5},{"$f":"AI20/AL20","v":2},null,{"$f":"AM20","v":2},{"$f":"IF(AND(AM20=1,AM21=1),\"\",AM21)","v":5},null,{"$f":"CONCATENATE(AI20,\"/\",AI21)","v":"10/25"},"=",{"$f":"CONCATENATE(AM20,\"/\",AM21)","v":"2/5"}]
{"$rows_left_out":43}
{"sheet":"Matrix","index":4,"n_rows":2481,"n_cols":6,"rows_kept":2481,"cut":false,"hidden":true,"merged":[[2,1,2,2]]}
[null,"a/b + c/d"]
[null,"a","b","c","d"]
[null,"2 -4 - 5 - 8 -10"]
[1,1,2,1,4,{"$f":"B4/C4+D4/E4","v":0.75}]
[2,1,2,1,5,0.7]
[3,1,2,2,5,0.9]
[4,1,2,1,8,0.625]
[5,1,2,3,8,0.875]
[6,1,2,1,10,0.6]
[7,1,2,3,10,0.8]
[8,1,4,1,2,0.75]
[9,1,4,3,4,1]
[10,1,4,1,5,0.45]
[11,1,4,2,5,0.65]
[12,1,4,1,8,0.375]
[13,1,4,3,8,0.625]
[14,1,4,5,8,0.875]
[15,1,4,1,10,0.35]
[16,1,4,3,10,0.55000000000000004]
[17,1,4,7,10,0.95]
{"$rows_left_out":2461}