{"text_format":"1","workbook":"xlsx","n_sheets":4,"sheets":["Values","Worksheet","Answers","Working"],"not_rendered":{"charts":0,"images":6,"macros":1,"external_links":0,"defined_names":0,"comments":0,"pivot_tables":0},"unopened":[],"bounds":{"document_bytes":16777216,"sheet_cells":100000,"rows_first":2000,"rows_last":500,"rows_between":2000,"halvings":0,"cell_chars":16384,"cell_head_chars":4096},"cells_cut":0,"cells_raw":0,"read":"whole","date_system":"1900"}

{"sheet":"Values","index":0,"n_rows":21,"n_cols":9,"rows_kept":21,"cut":false,"hidden":false,"merged":[[18,2,18,6],[18,8,22,9],[20,2,23,7],[3,2,3,6],[5,2,6,7],[17,2,17,7],[12,2,12,6]]}
[null,null,null,null,"ADDITION & SUBTRACTION OF FRACTIONS"]
[null,null,null,null,"Simplified, Mixed Numeral Answers"]
[]
[null,null,"INSTRUCTIONS"]
[]
[null,"Step 1","Click to select the denominators to be used for this sheet."]
[]
[null,null,null,null,null,null,null,null,"NOTES"]
[null,null,null,null,null,null,null,null,"* Some questions have improper fractions "]
[null,null,null,null,null,null,null,null,"   although the answer may be a mixed number"]
[null,null,null,null,null,null,null,null,"* Subtractions usually have a proper fraction answer."]
[]
[null,"Step 2","Click to select the type of operation."]
[]
[]
[]
[]
[]
[null,"Step 3","Click on WorkSheet tab below.",null,null,null,null,null,"PRESS F9 for NEW WorkSheet"]
[]
[null,"Note","If you click on the WorkSheet tab then hold down shift and click on the Solutions tab, you will be able to print both the WorkSheet and the solutions."]

{"sheet":"Worksheet","index":1,"n_rows":45,"n_cols":20,"rows_kept":45,"cut":false,"hidden":false,"merged":[[43,18,44,18],[34,0,35,0],[34,2,35,2],[34,4,35,4],[34,6,35,6],[34,8,35,8],[34,10,35,10],[43,10,44,10],[43,8,44,8],[43,12,44,12],[43,14,44,14],[43,6,44,6],[43,4,44,4],[43,2,44,2],[43,0,44,0],[43,16,44,16],[23,18,24,18],[34,16,35,16],[34,18,35,18],[34,12,35,12],[34,14,35,14],[23,16,24,16],[23,10,24,10],[23,8,24,8],[23,14,24,14],[14,10,15,10],[3,0,4,0],[14,0,15,0],[23,0,24,0],[3,2,4,2],[23,2,24,2],[14,2,15,2],[3,16,4,16],[3,18,4,18],[14,18,15,18],[14,16,15,16],[3,14,4,14],[14,14,15,14],[3,8,4,8],[23,4,24,4],[14,12,15,12],[3,6,4,6],[3,10,4,10],[14,6,15,6],[14,8,15,8],[3,12,4,12],[14,4,15,4],[3,4,4,4],[23,6,24,6],[23,12,24,12]]}
[null,null,null,null,null,null,null,null,{"$f":"Working!M1","v":"SUBTRACTION OF FRACTIONS"}]
[null,null,null,null,null,null,null,null,null,null,null,null,null,null,null,null,null,null,null,{"$f":"CONCATENATE(\"Worksheet \",Working!J1,Working!H1)","v":"Worksheet AFS - 391"}]
["Simplify the following;"]
[{"$f":"Working!B4","v":"1)"},{"$f":"Working!T4","v":6},{"$f":"Working!S4","v":"-"},{"$f":"Working!V4","v":1},{"$f":"Working!B14","v":"6)"},{"$f":"Working!T14","v":17},{"$f":"Working!S14","v":"-"},{"$f":"Working!V14","v":3},{"$f":"Working!B24","v":"11)"},{"$f":"Working!T24","v":19},{"$f":"Working!S24","v":"-"},{"$f":"Working!V24","v":6},{"$f":"Working!B34","v":"16)"},{"$f":"Working!T34","v":6},{"$f":"Working!S34","v":"-"},{"$f":"Working!V34","v":5},{"$f":"Working!B44","v":"21)"},{"$f":"Working!T44","v":31},{"$f":"Working!S44","v":"-"},{"$f":"Working!V44","v":4}]
[null,{"$f":"Working!T5","v":8},null,{"$f":"Working!V5","v":16},null,{"$f":"Working!T15","v":13},null,{"$f":"Working!V15","v":8},null,{"$f":"Working!T25","v":15},null,{"$f":"Working!V25","v":12},null,{"$f":"Working!T35","v":8},null,{"$f":"Working!V35","v":10},null,{"$f":"Working!T45","v":16},null,{"$f":"Working!V45","v":14}]
[]
[]
[]
[]
[]
[]
[]
[]
[]
[{"$f":"Working!B6","v":"2)"},{"$f":"Working!T6","v":9},{"$f":"Working!S6","v":"-"},{"$f":"Working!V6","v":3},{"$f":"Working!B16","v":"7)"},{"$f":"Working!T16","v":2},{"$f":"Working!S16","v":"-"},{"$f":"Working!V16","v":1},{"$f":"Working!B26","v":"12)"},{"$f":"Working!T26","v":4},{"$f":"Working!S26","v":"-"},{"$f":"Working!V26","v":2},{"$f":"Working!B36","v":"17)"},{"$f":"Working!T36","v":9},{"$f":"Working!S36","v":"-"},{"$f":"Working!V36","v":6},{"$f":"Working!B46","v":"22)"},{"$f":"Working!T46","v":4},{"$f":"Working!S46","v":"-"},{"$f":"Working!V46","v":1}]
[null,{"$f":"Working!T7","v":8},null,{"$f":"Working!V7","v":3},null,{"$f":"Working!T17","v":11},null,{"$f":"Working!V17","v":6},null,{"$f":"Working!T27","v":4},null,{"$f":"Working!V27","v":9},null,{"$f":"Working!T37","v":8},null,{"$f":"Working!V37","v":11},null,{"$f":"Working!T47","v":11},null,{"$f":"Working!V47","v":10}]
[]
[]
[]
[]
[]
[]
[]
[{"$f":"Working!B8","v":"3)"},{"$f":"Working!T8","v":4},{"$f":"Working!S8","v":"-"},{"$f":"Working!V8","v":5},{"$f":"Working!B18","v":"8)"},{"$f":"Working!T18","v":1},{"$f":"Working!S18","v":"-"},{"$f":"Working!V18","v":3},{"$f":"Working!B28","v":"13)"},{"$f":"Working!T28","v":4},{"$f":"Working!S28","v":"-"},{"$f":"Working!V28","v":3},{"$f":"Working!B38","v":"18)"},{"$f":"Working!T38","v":8},{"$f":"Working!S38","v":"-"},{"$f":"Working!V38","v":10},{"$f":"Working!B48","v":"23)"},{"$f":"Working!T48","v":6},{"$f":"Working!S48","v":"-"},{"$f":"Working!V48","v":3}]
[null,{"$f":"Working!T9","v":6},null,{"$f":"Working!V9","v":16},null,{"$f":"Working!T19","v":3},null,{"$f":"Working!V19","v":9},null,{"$f":"Working!T29","v":3},null,{"$f":"Working!V29","v":7},null,{"$f":"Working!T39","v":11},null,{"$f":"Working!V39","v":15},null,{"$f":"Working!T49","v":7},null,{"$f":"Working!V49","v":4}]
[]
[]
[]
[]
[]
[]
[]
[]
[]
[{"$f":"Working!B10","v":"4)"},{"$f":"Working!T10","v":18},{"$f":"Working!S10","v":"-"},{"$f":"Working!V10","v":12},{"$f":"Working!B20","v":"9)"},{"$f":"Working!T20","v":17},{"$f":"Working!S20","v":"-"},{"$f":"Working!V20","v":6},{"$f":"Working!B30","v":"14)"},{"$f":"Working!T30","v":4},{"$f":"Working!S30","v":"-"},{"$f":"Working!V30","v":8},{"$f":"Working!B40","v":"19)"},{"$f":"Working!T40","v":13},{"$f":"Working!S40","v":"-"},{"$f":"Working!V40","v":14},{"$f":"Working!B50","v":"24)"},{"$f":"Working!T50","v":11},{"$f":"Working!S50","v":"-"},{"$f":"Working!V50","v":13}]
[null,{"$f":"Working!T11","v":10},null,{"$f":"Working!V11","v":15},null,{"$f":"Working!T21","v":10},null,{"$f":"Working!V21","v":7},null,{"$f":"Working!T31","v":7},null,{"$f":"Working!V31","v":15},null,{"$f":"Working!T41","v":8},null,{"$f":"Working!V41","v":15},null,{"$f":"Working!T51","v":9},null,{"$f":"Working!V51","v":12}]
[]
[]
[]
[]
[]
[]
[]
[{"$f":"Working!B12","v":"5)"},{"$f":"Working!T12","v":5},{"$f":"Working!S12","v":"-"},{"$f":"Working!V12","v":1},{"$f":"Working!B22","v":"10)"},{"$f":"Working!T22","v":11},{"$f":"Working!S22","v":"-"},{"$f":"Working!V22","v":6},{"$f":"Working!B32","v":"15)"},{"$f":"Working!T32","v":23},{"$f":"Working!S32","v":"-"},{"$f":"Working!V32","v":6},{"$f":"Working!B42","v":"20)"},{"$f":"Working!T42","v":25},{"$f":"Working!S42","v":"-"},{"$f":"Working!V42","v":3},{"$f":"Working!B52","v":"25)"},{"$f":"Working!T52","v":8},{"$f":"Working!S52","v":"-"},{"$f":"Working!V52","v":1}]
[null,{"$f":"Working!T13","v":8},null,{"$f":"Working!V13","v":9},null,{"$f":"Working!T23","v":15},null,{"$f":"Working!V23","v":9},null,{"$f":"Working!T33","v":15},null,{"$f":"Working!V33","v":12},null,{"$f":"Working!T43","v":16},null,{"$f":"Working!V43","v":9},null,{"$f":"Working!T53","v":8},null,{"$f":"Working!V53","v":13}]

{"sheet":"Answers","index":2,"n_rows":57,"n_cols":25,"rows_kept":57,"cut":false,"hidden":false,"merged":[[51,0,52,0],[53,0,54,0],[51,5,52,5],[53,5,54,5],[40,15,41,15],[40,10,41,10],[40,5,41,5],[42,20,43,20],[42,15,43,15],[42,10,43,10],[42,5,43,5],[47,13,48,13],[47,15,48,15],[47,18,48,18],[42,0,43,0],[49,0,50,0],[49,3,50,3],[49,5,50,5],[49,8,50,8],[49,20,50,20],[49,18,50,18],[51,20,52,20],[53,20,54,20],[31,20,32,20],[18,20,19,20],[20,20,21,20],[25,20,26,20],[27,20,28,20],[9,0,10,0],[9,5,10,5],[9,10,10,10],[9,15,10,15],[29,10,30,10],[31,10,32,10],[29,15,30,15],[31,15,32,15],[29,0,30,0],[31,0,32,0],[11,5,12,5],[18,0,19,0],[18,15,19,15],[20,5,21,5],[18,10,19,10],[20,10,21,10],[5,0,6,0],[5,3,6,3],[5,5,6,5],[5,8,6,8],[7,0,8,0],[7,5,8,5],[7,20,8,20],[5,20,6,20],[29,5,30,5],[29,20,30,20],[16,8,17,8],[16,18,17,18],[11,6,12,6],[11,11,12,11],[5,10,6,10],[5,13,6,13],[5,15,6,15],[16,10,17,10],[16,13,17,13],[16,15,17,15],[7,10,8,10],[7,15,8,15],[5,18,6,18],[3,3,4,3],[3,5,4,5],[3,8,4,8],[3,10,4,10],[3,13,4,13],[3,15,4,15],[3,18,4,18],[3,20,4,20],[9,20,10,20],[25,18,26,18],[3,23,4,23],[14,0,15,0],[14,3,15,3],[14,5,15,5],[14,8,15,8],[14,10,15,10],[14,13,15,13],[14,15,15,15],[14,18,15,18],[25,23,26,23],[14,23,15,23],[16,20,17,20],[16,23,17,23],[14,20,15,20],[11,21,12,21],[11,20,12,20],[11,15,12,15],[11,10,12,10],[11,16,12,16],[11,0,12,0],[11,1,12,1],[5,23,6,23],[3,0,4,0],[25,0,26,0],[25,3,26,3],[25,5,26,5],[25,8,26,8],[25,10,26,10],[25,13,26,13],[25,15,26,15],[36,0,37,0],[36,3,37,3],[36,5,37,5],[36,8,37,8],[36,10,37,10],[33,10,34,10],[33,11,34,11],[33,15,34,15],[31,5,32,5],[36,23,37,23],[47,0,48,0],[47,3,48,3],[47,5,48,5],[47,8,48,8],[47,10,48,10],[38,18,39,18],[27,10,28,10],[27,13,28,13],[27,15,28,15],[27,18,28,18],[27,0,28,0],[27,3,28,3],[27,5,28,5],[27,8,28,8],[36,13,37,13],[27,23,28,23],[38,0,39,0],[38,3,39,3],[38,5,39,5],[38,8,39,8],[38,10,39,10],[33,5,34,5],[33,6,34,6],[49,23,50,23],[38,20,39,20],[38,23,39,23],[47,23,48,23],[47,20,48,20],[40,20,41,20],[16,3,17,3],[16,5,17,5],[20,0,21,0],[18,5,19,5],[20,15,21,15],[22,6,23,6],[22,10,23,10],[22,11,23,11],[22,15,23,15],[22,0,23,0],[22,1,23,1],[22,5,23,5],[16,0,17,0],[22,16,23,16],[22,20,23,20],[22,21,23,21],[33,0,34,0],[33,1,34,1],[33,21,34,21],[44,0,45,0],[44,1,45,1],[44,5,45,5],[44,6,45,6],[44,10,45,10],[44,11,45,11],[44,15,45,15],[40,0,41,0],[44,20,45,20],[44,21,45,21],[36,15,37,15],[36,18,37,18],[36,20,37,20],[33,20,34,20],[33,16,34,16],[49,10,50,10],[49,13,50,13],[49,15,50,15],[51,10,52,10],[53,10,54,10],[51,15,52,15],[38,13,39,13],[38,15,39,15],[44,16,45,16],[53,15,54,15],[55,0,56,0],[55,1,56,1],[55,5,56,5],[55,6,56,6],[55,10,56,10],[55,11,56,11],[55,16,56,16],[55,20,56,20],[55,21,56,21],[55,15,56,15]]}
[null,null,null,null,null,null,null,null,null,null,{"$f":"Working!M1","v":"SUBTRACTION OF FRACTIONS"}]
[null,null,null,null,null,null,null,null,null,null,"Solutions",null,null,null,null,null,null,null,null,null,null,null,null,null,{"$f":" CONCATENATE(\"Worksheet \",Working!J1,Working!H1)","v":"Worksheet AFS - 391"}]
["Simplify the following;"]
[{"$f":" Working!B4","v":"1)"},null,{"$f":" Working!T4","v":6},{"$f":"Working!$S4","v":"-"},{"$f":" Working!V4","v":1},{"$f":" Working!B14","v":"6)"},null,{"$f":" Working!T14","v":17},{"$f":"Working!S14","v":"-"},{"$f":" Working!V14","v":3},{"$f":" Working!B24","v":"11)"},null,{"$f":" Working!T24","v":19},{"$f":"Working!S24","v":"-"},{"$f":" Working!V24","v":6},{"$f":" Working!B34","v":"16)"},null,{"$f":" Working!T34","v":6},{"$f":"Working!S34","v":"-"},{"$f":" Working!V34","v":5},{"$f":" Working!B44","v":"21)"},null,{"$f":" Working!T44","v":31},{"$f":"Working!S44","v":"-"},{"$f":" Working!V44","v":4}]
[null,null,{"$f":" Working!T5","v":8},null,{"$f":" Working!V5","v":16},null,null,{"$f":" Working!T15","v":13},null,{"$f":" Working!V15","v":8},null,null,{"$f":" Working!T25","v":15},null,{"$f":" Working!V25","v":12},null,null,{"$f":" Working!T35","v":8},null,{"$f":" Working!V35","v":10},null,null,{"$f":" Working!T45","v":16},null,{"$f":" Working!V45","v":14}]
["=",null,{"$f":"Working!$X4","v":96},{"$f":"Working!$S4","v":"-"},{"$f":"Working!$Z4","v":8},"=",null,{"$f":"Working!$X14","v":136},{"$f":"Working!S14","v":"-"},{"$f":"Working!$Z14","v":39},"=",null,{"$f":"Working!$X24","v":228},{"$f":"Working!S24","v":"-"},{"$f":"Working!$Z24","v":90},"=",null,{"$f":"Working!$X34","v":60},{"$f":"Working!S34","v":"-"},{"$f":"Working!$Z34","v":40},"=",null,{"$f":"Working!$X44","v":434},{"$f":"Working!S44","v":"-"},{"$f":"Working!$Z44","v":64}]
[null,null,{"$f":"Working!$K4","v":128},null,{"$f":"Working!$K4","v":128},null,null,{"$f":"Working!$K14","v":104},null,{"$f":"Working!$K14","v":104},null,null,{"$f":"Working!$K24","v":180},null,{"$f":"Working!$K24","v":180},null,null,{"$f":"Working!$K34","v":80},null,{"$f":"Working!$K34","v":80},null,null,{"$f":"Working!$K44","v":224},null,{"$f":"Working!$K44","v":224}]
["=",null,{"$f":"Working!$AB4","v":88},null,null,"=",null,{"$f":"Working!$AB14","v":97},null,null,"=",null,{"$f":"Working!$AB24","v":138},null,null,"=",null,{"$f":"Working!$AB34","v":20},null,null,"=",null,{"$f":"Working!$AB44","v":370}]
[null,null,{"$f":"Working!$AB5","v":128},null,null,null,null,{"$f":"Working!$AB15","v":104},null,null,null,null,{"$f":"Working!$AB25","v":180},null,null,null,null,{"$f":"Working!$AB35","v":80},null,null,null,null,{"$f":"Working!$AB45","v":224}]
[{"$f":"IF(C10=\"\",\"\",\"=\")","v":"="},null,{"$f":"IF(Working!$AF4=Working!$AB4,\"\",Working!$AF4)","v":11},null,null,{"$f":"IF(H10=\"\",\"\",\"=\")","v":""},null,{"$f":"IF(Working!$AF14=H8,\"\",Working!$AF14)","v":""},null,null,{"$f":"IF(M10=\"\",\"\",\"=\")","v":"="},null,{"$f":"IF(Working!$AF24=M8,\"\",Working!$AF24)","v":23},null,null,{"$f":"IF(R10=\"\",\"\",\"=\")","v":"="},null,{"$f":"IF(Working!$AF34=R8,\"\",Working!$AF34)","v":1},null,null,{"$f":"IF(W10=\"\",\"\",\"=\")","v":"="},null,{"$f":"IF(Working!$AF44=W8,\"\",Working!$AF44)","v":185}]
[null,null,{"$f":"IF(Working!$AF4=Working!$AB4,\"\",Working!$AF5)","v":16},null,null,null,null,{"$f":"IF(Working!$AF14=H8,\"\",Working!$AF15)","v":""},null,null,null,null,{"$f":"IF(Working!$AF24=M8,\"\",Working!$AF25)","v":30},null,null,null,null,{"$f":"IF(Working!$AF34=R8,\"\",Working!$AF35)","v":4},null,null,null,null,{"$f":"IF(Working!$AF44=W8,\"\",Working!$AF45)","v":112}]
[{"$f":"IF(AND(C12=\"\",B12=\"\"),\"\",\"=\")","v":""},{"$f":"IF(Working!$AB4=0,\"0\",IF(Working!$AH4=0,\"\",Working!$AH4))","v":""},{"$f":"IF(Working!$AH4=0,\"\",IF(Working!$AI4=Working!$AB4,\"\",Working!$AL4))","v":""},null,null,{"$f":"IF(AND(H12=\"\",G12=\"\"),\"\",\"=\")","v":""},{"$f":"IF(Working!$AB14=0,\"0\",IF(Working!$AH14=0,\"\",Working!$AH14))","v":""},{"$f":"IF(Working!$AH14=0,\"\",IF(Working!$AI14=H8,\"\",Working!$AL14))","v":""},null,null,{"$f":"IF(AND(M12=\"\",L12=\"\"),\"\",\"=\")","v":""},{"$f":"IF(Working!$AB24=0,\"0\",IF(Working!$AH24=0,\"\",Working!$AH24))","v":""},{"$f":"IF(Working!$AH24=0,\"\",IF(Working!$AI24=M8,\"\",Working!$AL24))","v":""},null,null,{"$f":"IF(AND(R12=\"\",Q12=\"\"),\"\",\"=\")","v":""},{"$f":"IF(Working!$AB34=0,\"0\",IF(Working!$AH34=0,\"\",Working!$AH34))","v":""},{"$f":"IF(Working!$AH34=0,\"\",IF(Working!$AI34=R8,\"\",Working!$AI34))","v":""},null,null,{"$f":"IF(AND(W12=\"\",V12=\"\"),\"\",\"=\")","v":"="},{"$f":"IF(Working!$AB44=0,\"0\",IF(Working!$AH44=0,\"\",Working!$AH44))","v":1},{"$f":"IF(Working!$AH44=0,\"\",IF(Working!$AI44=W8,\"\",Working!$AL44))","v":73}]
[null,null,{"$f":"IF(Working!$AH4=0,\"\",IF(Working!$AI4=C8,\"\",Working!$AL5))","v":""},null,null,null,null,{"$f":"IF(Working!$AH14=0,\"\",IF(Working!$AI14=H8,\"\",Working!$AL15))","v":""},null,null,null,null,{"$f":"IF(Working!$AH24=0,\"\",IF(Working!$AI24=M8,\"\",Working!$AL25))","v":""},null,null,null,null,{"$f":"IF(Working!$AH34=0,\"\",IF(Working!$AI34=R8,\"\",Working!$AL35))","v":""},null,null,null,null,{"$f":"IF(Working!$AH44=0,\"\",IF(Working!$AI44=W8,\"\",Working!$AL45))","v":112}]
[]
[{"$f":"Working!B6","v":"2)"},null,{"$f":"Working!T6","v":9},{"$f":"Working!$S6","v":"-"},{"$f":"Working!V6","v":3},{"$f":"Working!B16","v":"7)"},null,{"$f":"Working!T16","v":2},{"$f":"Working!$S16","v":"-"},{"$f":"Working!V16","v":1},{"$f":"Working!B26","v":"12)"},null,{"$f":"Working!T26","v":4},{"$f":"Working!$S26","v":"-"},{"$f":"Working!V26","v":2},{"$f":"Working!B36","v":"17)"},null,{"$f":"Working!T36","v":9},{"$f":"Working!$S36","v":"-"},{"$f":"Working!V36","v":6},{"$f":"Working!B46","v":"22)"},null,{"$f":"Working!T46","v":4},{"$f":"Working!$S46","v":"-"},{"$f":"Working!V46","v":1}]
[null,null,{"$f":"Working!T7","v":8},null,{"$f":"Working!V7","v":3},null,null,{"$f":"Working!T17","v":11},null,{"$f":"Working!V17","v":6},null,null,{"$f":"Working!T27","v":4},null,{"$f":"Working!V27","v":9},null,null,{"$f":"Working!T37","v":8},null,{"$f":"Working!V37","v":11},null,null,{"$f":"Working!T47","v":11},null,{"$f":"Working!V47","v":10}]
["=",null,{"$f":"Working!$X6","v":24},{"$f":"Working!$S6","v":"-"},{"$f":"Working!$Z6","v":27},"=",null,{"$f":"Working!$X15","v":104},{"$f":"Working!$S16","v":"-"},{"$f":"Working!$Z16","v":11},"=",null,{"$f":"Working!$X26","v":36},{"$f":"Working!$S26","v":"-"},{"$f":"Working!$Z26","v":8},"=",null,{"$f":"Working!$X36","v":48},{"$f":"Working!$S36","v":"-"},{"$f":"Working!$Z36","v":99},"=",null,{"$f":"Working!$X46","v":40},{"$f":"Working!$S46","v":"-"},{"$f":"Working!$Z46","v":11}]
[null,null,{"$f":"Working!$K6","v":24},null,{"$f":"Working!$K6","v":24},null,null,{"$f":"Working!$K16","v":66},null,{"$f":"Working!$K16","v":66},null,null,{"$f":"Working!$K26","v":36},null,{"$f":"Working!$K26","v":36},null,null,{"$f":"Working!$K36","v":88},null,{"$f":"Working!$K36","v":88},null,null,{"$f":"Working!$K46","v":110},null,{"$f":"Working!$K46","v":110}]
["=",null,{"$f":"Working!$AB6","v":3},null,null,"=",null,{"$f":"Working!$AB16","v":1},null,null,"=",null,{"$f":"Working!$AB26","v":28},null,null,"=",null,{"$f":"Working!$AB36","v":51},null,null,"=",null,{"$f":"Working!$AB46","v":29}]
[null,null,{"$f":"Working!$AB7","v":24},null,null,null,null,{"$f":"Working!$AB17","v":66},null,null,null,null,{"$f":"Working!$AB27","v":36},null,null,null,null,{"$f":"Working!$AB37","v":88},null,null,null,null,{"$f":"Working!$AB47","v":110}]
[{"$f":"IF(C21=\"\",\"\",\"=\")","v":"="},null,{"$f":"IF(Working!$AF6=C19,\"\",Working!$AF6)","v":1},null,null,{"$f":"IF(H21=\"\",\"\",\"=\")","v":""},null,{"$f":"IF(Working!$AF16=H19,\"\",Working!$AF16)","v":""},null,null,{"$f":"IF(M21=\"\",\"\",\"=\")","v":"="},null,{"$f":"IF(Working!$AF26=M19,\"\",Working!$AF26)","v":7},null,null,{"$f":"IF(R21=\"\",\"\",\"=\")","v":""},null,{"$f":"IF(Working!$AF36=R19,\"\",Working!$AF36)","v":""},null,null,{"$f":"IF(W21=\"\",\"\",\"=\")","v":""},null,{"$f":"IF(Working!$AF46=W19,\"\",Working!$AF46)","v":""}]
[null,null,{"$f":"IF(Working!$AF6=C19,\"\",Working!$AF7)","v":8},null,null,null,null,{"$f":"IF(Working!$AF16=H19,\"\",Working!$AF17)","v":""},null,null,null,null,{"$f":"IF(Working!$AF26=M19,\"\",Working!$AF27)","v":9},null,null,null,null,{"$f":"IF(Working!$AF36=R19,\"\",Working!$AF37)","v":""},null,null,null,null,{"$f":"IF(Working!$AF46=W19,\"\",Working!$AF47)","v":""}]
[{"$f":"IF(AND(C23=\"\",B23=\"\"),\"\",\"=\")","v":""},{"$f":"IF(Working!AB6=0,\"0\",IF(Working!$AH6=0,\"\",Working!$AH6))","v":""},{"$f":"IF(Working!$AH6=0,\"\",IF(Working!$AI6=C19,\"\",Working!$AL6))","v":""},null,null,{"$f":"IF(AND(H23=\"\",G23=\"\"),\"\",\"=\")","v":""},{"$f":"IF(Working!$AB16=0,\"0\",IF(Working!$AH16=0,\"\",Working!$AH16))","v":""},{"$f":"IF(Working!$AH16=0,\"\",IF(Working!$AI16=H19,\"\",Working!$AL16))","v":""},null,null,{"$f":"IF(AND(M23=\"\",L23=\"\"),\"\",\"=\")","v":""},{"$f":"IF(Working!$AB26=0,\"0\",IF(Working!$AH26=0,\"\",Working!$AH26))","v":""},{"$f":"IF(Working!$AH26=0,\"\",IF(Working!$AI26=M19,\"\",Working!$AL26))","v":""},null,null,{"$f":"IF(AND(R23=\"\",Q23=\"\"),\"\",\"=\")","v":""},{"$f":"IF(Working!$AB36=0,\"0\",IF(Working!$AH36=0,\"\",Working!$AH36))","v":""},{"$f":"IF(Working!$AH36=0,\"\",IF(Working!$AI36=R19,\"\",Working!$AL36))","v":""},null,null,{"$f":"IF(AND(W23=\"\",V23=\"\"),\"\",\"=\")","v":""},{"$f":"IF(Working!$AB46=0,\"0\",IF(Working!$AH46=0,\"\",Working!$AH46))","v":""},{"$f":"IF(Working!$AH46=0,\"\",IF(Working!$AI46=W19,\"\",Working!$AL46))","v":""}]
[null,null,{"$f":"IF(Working!$AH6=0,\"\",IF(Working!$AI6=C19,\"\",Working!$AL7))","v":""},null,null,null,null,{"$f":"IF(Working!$AH16=0,\"\",IF(Working!$AI16=H19,\"\",Working!$AL17))","v":""},null,null,null,null,{"$f":"IF(Working!$AH26=0,\"\",IF(Working!$AI26=M19,\"\",Working!$AL27))","v":""},null,null,null,null,{"$f":"IF(Working!$AH36=0,\"\",IF(Working!$AI36=R19,\"\",Working!$AL37))","v":""},null,null,null,null,{"$f":"IF(Working!$AH46=0,\"\",IF(Working!$AI46=W19,\"\",Working!$AL47))","v":""}]
[]
[{"$f":"Working!B8","v":"3)"},null,{"$f":"Working!T8","v":4},{"$f":"Working!$S8","v":"-"},{"$f":"Working!V8","v":5},{"$f":"Working!B18","v":"8)"},null,{"$f":"Working!T18","v":1},{"$f":"Working!$S18","v":"-"},{"$f":"Working!V18","v":3},{"$f":"Working!B28","v":"13)"},null,{"$f":"Working!T28","v":4},{"$f":"Working!$S28","v":"-"},{"$f":"Working!V28","v":3},{"$f":"Working!B38","v":"18)"},null,{"$f":"Working!T38","v":8},{"$f":"Working!$S38","v":"-"},{"$f":"Working!V38","v":10},{"$f":"Working!B48","v":"23)"},null,{"$f":"Working!T48","v":6},{"$f":"Working!$S48","v":"-"},{"$f":"Working!V48","v":3}]
[null,null,{"$f":"Working!T9","v":6},null,{"$f":"Working!V9","v":16},null,null,{"$f":"Working!T19","v":3},null,{"$f":"Working!V19","v":9},null,null,{"$f":"Working!T29","v":3},null,{"$f":"Working!V29","v":7},null,null,{"$f":"Working!T39","v":11},null,{"$f":"Working!V39","v":15},null,null,{"$f":"Working!T49","v":7},null,{"$f":"Working!V49","v":4}]
["=",null,{"$f":"Working!$X8","v":30},{"$f":"Working!$S8","v":"-"},{"$f":"Working!$Z8","v":64},"=",null,{"$f":"Working!$X18","v":9},{"$f":"Working!$S18","v":"-"},{"$f":"Working!$Z18","v":9},"=",null,{"$f":"Working!$X28","v":28},{"$f":"Working!$S28","v":"-"},{"$f":"Working!$Z28","v":9},"=",null,{"$f":"Working!$X38","v":120},{"$f":"Working!$S38","v":"-"},{"$f":"Working!$Z38","v":110},"=",null,{"$f":"Working!$X48","v":21},{"$f":"Working!$S48","v":"-"},{"$f":"Working!$Z48","v":24}]
[null,null,{"$f":"Working!$K8","v":96},null,{"$f":"Working!$K8","v":96},null,null,{"$f":"Working!$K18","v":27},null,{"$f":"Working!$K18","v":27},null,null,{"$f":"Working!$K28","v":21},null,{"$f":"Working!$K28","v":21},null,null,{"$f":"Working!$K38","v":165},null,{"$f":"Working!$K38","v":165},null,null,{"$f":"Working!$K48","v":28},null,{"$f":"Working!$K48","v":28}]
["=",null,{"$f":"Working!$AB8","v":34},null,null,"=",null,{"$f":"Working!$AB18","v":0},null,null,"=",null,{"$f":"Working!$AB28","v":19},null,null,"=",null,{"$f":"Working!$AB38","v":10},null,null,"=",null,{"$f":"Working!$AB48","v":3}]
[null,null,{"$f":"Working!$AB9","v":96},null,null,null,null,{"$f":"Working!$AB19","v":27},null,null,null,null,{"$f":"Working!$AB29","v":21},null,null,null,null,{"$f":"Working!$AB39","v":165},null,null,null,null,{"$f":"Working!$AB49","v":28}]
[{"$f":"IF(C32=\"\",\"\",\"=\")","v":"="},null,{"$f":"IF(Working!$AF8=C30,\"\",Working!$AF8)","v":17},null,null,{"$f":"IF(H32=\"\",\"\",\"=\")","v":""},null,{"$f":"IF(Working!$AF18=H30,\"\",Working!$AF18)","v":""},null,null,{"$f":"IF(M32=\"\",\"\",\"=\")","v":""},null,{"$f":"IF(Working!$AF28=M30,\"\",Working!$AF28)","v":""},null,null,{"$f":"IF(R32=\"\",\"\",\"=\")","v":"="},null,{"$f":"IF(Working!$AF38=R30,\"\",Working!AF38)","v":2},null,null,{"$f":"IF(W32=\"\",\"\",\"=\")","v":""},null,{"$f":"IF(Working!$AF48=W30,\"\",Working!$AF48)","v":""}]
[null,null,{"$f":"IF(Working!$AF8=C30,\"\",Working!$AF9)","v":48},null,null,null,null,{"$f":"IF(Working!$AF18=H30,\"\",Working!$AF19)","v":""},null,null,null,null,{"$f":"IF(Working!$AF28=M30,\"\",Working!$AF29)","v":""},null,null,null,null,{"$f":"IF(Working!$AF38=R30,\"\",Working!$AF39)","v":33},null,null,null,null,{"$f":"IF(Working!$AF48=W30,\"\",Working!$AF49)","v":""}]
[{"$f":"IF(AND(C34=\"\",B34=\"\"),\"\",\"=\")","v":""},{"$f":"IF(Working!AB8=0,\"0\",IF(Working!$AH8=0,\"\",Working!$AH8))","v":""},{"$f":"IF(Working!$AH8=0,\"\",IF(Working!$AI8=C30,\"\",Working!$AL8))","v":""},null,null,{"$f":"IF(AND(H34=\"\",G34=\"\"),\"\",\"=\")","v":"="},{"$f":"IF(Working!$AB18=0,\"0\",IF(Working!$AH18=0,\"\",Working!$AH18))","v":"0"},{"$f":"IF(Working!$AI18=0,\"\",IF(Working!$AI18=H30,\"\",Working!$AL18))","v":""},null,null,{"$f":"IF(AND(M34=\"\",L34=\"\"),\"\",\"=\")","v":""},{"$f":"IF(Working!$AB28=0,\"0\",IF(Working!$AH28=0,\"\",Working!$AH28))","v":""},{"$f":"IF(Working!$AI28=0,\"\",IF(Working!$AI28=M30,\"\",Working!$AL28))","v":""},null,null,{"$f":"IF(AND(R34=\"\",Q34=\"\"),\"\",\"=\")","v":""},{"$f":"IF(Working!$AB38=0,\"0\",IF(Working!$AH38=0,\"\",Working!$AH38))","v":""},{"$f":"IF(Working!$AI38=0,\"\",IF(Working!$AI38=R30,\"\",Working!$AL38))","v":""},null,null,{"$f":"IF(AND(W34=\"\",V34=\"\"),\"\",\"=\")","v":""},{"$f":"IF(Working!$AB48=0,\"0\",IF(Working!$AH48=0,\"\",Working!$AH48))","v":""},{"$f":"IF(Working!$AI48=0,\"\",IF(Working!$AI48=W30,\"\",Working!$AL48))","v":""}]
[null,null,{"$f":"IF(Working!$AH8=0,\"\",IF(Working!$AI8=C30,\"\",Working!$AL9))","v":""},null,null,null,null,{"$f":"IF(Working!$AI18=0,\"\",IF(Working!$AI18=H30,\"\",Working!$AL19))","v":""},null,null,null,null,{"$f":"IF(Working!$AI28=0,\"\",IF(Working!$AI28=M30,\"\",Working!$AL29))","v":""},null,null,null,null,{"$f":"IF(Working!$AI38=0,\"\",IF(Working!$AI38=R30,\"\",Working!$AL39))","v":""},null,null,null,null,{"$f":"IF(Working!$AI48=0,\"\",IF(Working!$AI48=W30,\"\",Working!$AL49))","v":""}]
[]
[{"$f":"Working!B10","v":"4)"},null,{"$f":"Working!T10","v":18},{"$f":"Working!$S10","v":"-"},{"$f":"Working!V10","v":12},{"$f":"Working!B20","v":"9)"},null,{"$f":"Working!T20","v":17},{"$f":"Working!$S20","v":"-"},{"$f":"Working!V20","v":6},{"$f":"Working!B30","v":"14)"},null,{"$f":"Working!T30","v":4},{"$f":"Working!$S30","v":"-"},{"$f":"Working!V30","v":8},{"$f":"Working!B40","v":"19)"},null,{"$f":"Working!T40","v":13},{"$f":"Working!$S40","v":"-"},{"$f":"Working!V40","v":14},{"$f":"Working!B50","v":"24)"},null,{"$f":"Working!T50","v":11},{"$f":"Working!$S50","v":"-"},{"$f":"Working!V50","v":13}]
[null,null,{"$f":"Working!T11","v":10},null,{"$f":"Working!V11","v":15},null,null,{"$f":"Working!T21","v":10},null,{"$f":"Working!V21","v":7},null,null,{"$f":"Working!T31","v":7},null,{"$f":"Working!V31","v":15},null,null,{"$f":"Working!T41","v":8},null,{"$f":"Working!V41","v":15},null,null,{"$f":"Working!T51","v":9},null,{"$f":"Working!V51","v":12}]
["=",null,{"$f":"Working!$X10","v":270},{"$f":"Working!$S10","v":"-"},{"$f":"Working!$Z10","v":120},"=",null,{"$f":"Working!$X20","v":119},{"$f":"Working!$S20","v":"-"},{"$f":"Working!$Z20","v":60},"=",null,{"$f":"Working!$X30","v":56},{"$f":"Working!$S30","v":"-"},{"$f":"Working!$Z30","v":60},"=",null,{"$f":"Working!$X40","v":195},{"$f":"Working!$S40","v":"-"},{"$f":"Working!$Z40","v":112},"=",null,{"$f":"Working!$X50","v":132},{"$f":"Working!$S50","v":"-"},{"$f":"Working!$Z50","v":117}]
[null,null,{"$f":"Working!$K10","v":150},null,{"$f":"Working!$K10","v":150},null,null,{"$f":"Working!$K20","v":70},null,{"$f":"Working!$K20","v":70},null,null,{"$f":"Working!$K30","v":105},null,{"$f":"Working!$K30","v":105},null,null,{"$f":"Working!$K30","v":105},null,{"$f":"Working!$K30","v":105},null,null,{"$f":"Working!$K50","v":108},null,{"$f":"Working!$K50","v":108}]
["=",null,{"$f":"Working!$AB10","v":150},null,null,"=",null,{"$f":"Working!$AB20","v":59},null,null,"=",null,{"$f":"Working!$AB30","v":4},null,null,"=",null,{"$f":"Working!$AB40","v":83},null,null,"=",null,{"$f":"Working!$AB50","v":15}]
[null,null,{"$f":"Working!$AB11","v":150},null,null,null,null,{"$f":"Working!$AB21","v":70},null,null,null,null,{"$f":"Working!$AB30","v":4},null,null,null,null,{"$f":"Working!$AB31","v":105},null,null,null,null,{"$f":"Working!$AB51","v":108}]
[{"$f":"IF(C43=\"\",\"\",\"=\")","v":"="},null,{"$f":"IF(Working!$AF10=C41,\"\",Working!$AF10)","v":1},null,null,{"$f":"IF(H43=\"\",\"\",\"=\")","v":""},null,{"$f":"IF(Working!$AF20=H41,\"\",Working!$AF20)","v":""},null,null,{"$f":"IF(M43=\"\",\"\",\"=\")","v":""},null,{"$f":"IF(Working!$AF30=M41,\"\",Working!$AF30)","v":""},null,null,{"$f":"IF(R43=\"\",\"\",\"=\")","v":""},null,{"$f":"IF(Working!$AF40=R41,\"\",Working!$AF40)","v":""},null,null,{"$f":"IF(W43=\"\",\"\",\"=\")","v":"="},null,{"$f":"IF(Working!$AF50=W41,\"\",Working!$AF50)","v":5}]
[null,null,{"$f":"IF(Working!$AF10=C41,\"\",Working!$AF11)","v":1},null,null,null,null,{"$f":"IF(Working!$AF20=H41,\"\",Working!$AF21)","v":""},null,null,null,null,{"$f":"IF(Working!$AF30=M41,\"\",Working!$AF31)","v":""},null,null,null,null,{"$f":"IF(Working!$AF40=R41,\"\",Working!$AF41)","v":""},null,null,null,null,{"$f":"IF(Working!$AF50=W41,\"\",Working!$AF51)","v":36}]
[{"$f":"IF(AND(C45=\"\",B45=\"\"),\"\",\"=\")","v":"="},{"$f":"IF(Working!AB10=0,\"0\",IF(Working!$AH10=0,\"\",Working!$AH10))","v":1},{"$f":"IF(Working!$AI10=0,\"\",IF(Working!$AI10=C41,\"\",Working!$AL10))","v":""},null,null,{"$f":"IF(AND(H45=\"\",G45=\"\"),\"\",\"=\")","v":""},{"$f":"IF(Working!$AB20=0,\"0\",IF(Working!$AH20=0,\"\",Working!$AH20))","v":""},{"$f":"IF(Working!$AH20=0,\"\",IF(Working!$AI20=H41,\"\",Working!$AL20))","v":""},null,null,{"$f":"IF(AND(M45=\"\",L45=\"\"),\"\",\"=\")","v":""},{"$f":"IF(Working!$AB30=0,\"0\",IF(Working!$AH30=0,\"\",Working!$AH30))","v":""},{"$f":"IF(Working!$AH30=0,\"\",IF(Working!$AI30=M41,\"\",Working!$AL30))","v":""},null,null,{"$f":"IF(AND(R45=\"\",Q45=\"\"),\"\",\"=\")","v":""},{"$f":"IF(Working!$AB40=0,\"0\",IF(Working!$AH40=0,\"\",Working!$AH40))","v":""},{"$f":"IF(Working!$AH40=0,\"\",IF(Working!$AI40=R41,\"\",Working!$AL40))","v":""},null,null,{"$f":"IF(AND(W45=\"\",V45=\"\"),\"\",\"=\")","v":""},{"$f":"IF(Working!$AB50=0,\"0\",IF(Working!$AH50=0,\"\",Working!$AH50))","v":""},{"$f":"IF(Working!$AH50=0,\"\",IF(Working!$AI50=W41,\"\",Working!$AL50))","v":""}]
[null,null,{"$f":"IF(Working!$AI10=0,\"\",IF(Working!$AI10=C41,\"\",Working!$AL11))","v":1},null,null,null,null,{"$f":"IF(Working!$AH20=0,\"\",IF(Working!$AI20=H41,\"\",Working!$AL21))","v":""},null,null,null,null,{"$f":"IF(Working!$AH30=0,\"\",IF(Working!$AI30=M41,\"\",Working!$AL31))","v":""},null,null,null,null,{"$f":"IF(Working!$AH40=0,\"\",IF(Working!$AI40=R41,\"\",Working!$AL41))","v":""},null,null,null,null,{"$f":"IF(Working!$AH50=0,\"\",IF(Working!$AI50=W41,\"\",Working!$AL51))","v":""}]
[]
[{"$f":"Working!B12","v":"5)"},null,{"$f":"Working!T12","v":5},{"$f":"Working!$S12","v":"-"},{"$f":"Working!V12","v":1},{"$f":"Working!B22","v":"10)"},null,{"$f":"Working!T22","v":11},{"$f":"Working!$S22","v":"-"},{"$f":"Working!V22","v":6},{"$f":"Working!B32","v":"15)"},null,{"$f":"Working!T32","v":23},{"$f":"Working!$S32","v":"-"},{"$f":"Working!V32","v":6},{"$f":"Working!B42","v":"20)"},null,{"$f":"Working!T42","v":25},{"$f":"Working!$S42","v":"-"},{"$f":"Working!V42","v":3},{"$f":"Working!B52","v":"25)"},null,{"$f":"Working!T52","v":8},{"$f":"Working!$S52","v":"-"},{"$f":"Working!V52","v":1}]
[null,null,{"$f":"Working!T13","v":8},null,{"$f":"Working!V13","v":9},null,null,{"$f":"Working!T23","v":15},null,{"$f":"Working!V23","v":9},null,null,{"$f":"Working!T33","v":15},null,{"$f":"Working!V33","v":12},null,null,{"$f":"Working!T43","v":16},null,{"$f":"Working!V43","v":9},null,null,{"$f":"Working!T53","v":8},null,{"$f":"Working!V53","v":13}]
["=",null,{"$f":"Working!$X12","v":45},{"$f":"Working!$S12","v":"-"},{"$f":"Working!$Z12","v":8},"=",null,{"$f":"Working!$X22","v":90},{"$f":"Working!$S22","v":"-"},{"$f":"Working!$Z22","v":99},"=",null,{"$f":"Working!$X32","v":276},{"$f":"Working!$S32","v":"-"},{"$f":"Working!$Z32","v":90},"=",null,{"$f":"Working!$X42","v":225},{"$f":"Working!$S42","v":"-"},{"$f":"Working!$Z42","v":48},"=",null,{"$f":"Working!$X50","v":132},{"$f":"Working!$S52","v":"-"},{"$f":"Working!$Z52","v":8}]
[null,null,{"$f":"Working!$K12","v":72},null,{"$f":"Working!$K12","v":72},null,null,{"$f":"Working!$K22","v":135},null,{"$f":"Working!$K22","v":135},null,null,{"$f":"Working!$K32","v":180},null,{"$f":"Working!$K32","v":180},null,null,{"$f":"Working!$K42","v":144},null,{"$f":"Working!$K42","v":144},null,null,{"$f":"Working!$K52","v":104},null,{"$f":"Working!$K52","v":104}]
["=",null,{"$f":"Working!$AB12","v":37},null,null,"=",null,{"$f":"Working!$AB22","v":9},null,null,"=",null,{"$f":"Working!$AB32","v":186},null,null,"=",null,{"$f":"Working!$AB42","v":177},null,null,"=",null,{"$f":"Working!$AB52","v":96}]
[null,null,{"$f":"Working!$AB13","v":72},null,null,null,null,{"$f":"Working!$AB23","v":135},null,null,null,null,{"$f":"Working!$AB33","v":180},null,null,null,null,{"$f":"Working!$AB43","v":144},null,null,null,null,{"$f":"Working!$AB53","v":104}]
[{"$f":"IF(C54=\"\",\"\",\"=\")","v":""},null,{"$f":"IF(Working!$AF12=C52,\"\",Working!$AF12)","v":""},null,null,{"$f":"IF(H54=\"\",\"\",\"=\")","v":"="},null,{"$f":"IF(Working!$AF22=H52,\"\",Working!$AF22)","v":1},null,null,{"$f":"IF(M54=\"\",\"\",\"=\")","v":"="},null,{"$f":"IF(Working!$AF32=M52,\"\",Working!$AF32)","v":31},null,null,{"$f":"IF(R54=\"\",\"\",\"=\")","v":"="},null,{"$f":"IF(Working!$AF42=R52,\"\",Working!$AF42)","v":59},null,null,{"$f":"IF(W54=\"\",\"\",\"=\")","v":"="},null,{"$f":"IF(Working!$AF52=W52,\"\",Working!$AF52)","v":12}]
[null,null,{"$f":"IF(Working!$AF12=C52,\"\",Working!$AF13)","v":""},null,null,null,null,{"$f":"IF(Working!$AF22=H52,\"\",Working!$AF23)","v":15},null,null,null,null,{"$f":"IF(Working!$AF32=M52,\"\",Working!$AF33)","v":30},null,null,null,null,{"$f":"IF(Working!$AF42=R52,\"\",Working!$AF43)","v":48},null,null,null,null,{"$f":"IF(Working!$AF52=W52,\"\",Working!$AF53)","v":13}]
[{"$f":"IF(AND(C56=\"\",B56=\"\"),\"\",\"=\")","v":""},{"$f":"IF(Working!AB12=0,\"0\",IF(Working!$AH12=0,\"\",Working!$AH12))","v":""},{"$f":"IF(Working!$AH12=0,\"\",IF(Working!$AI12=C52,\"\",Working!$AL12))","v":""},null,null,{"$f":"IF(AND(H56=\"\",G56=\"\"),\"\",\"=\")","v":""},{"$f":"IF(Working!$AB22=0,\"0\",IF(Working!$AH22=0,\"\",Working!$AH22))","v":""},{"$f":"IF(Working!$AH22=0,\"\",IF(Working!$AI22=H52,\"\",Working!$AL22))","v":""},null,null,{"$f":"IF(AND(M56=\"\",L56=\"\"),\"\",\"=\")","v":"="},{"$f":"IF(Working!$AB32=0,\"0\",IF(Working!$AH32=0,\"\",Working!$AH32))","v":1},{"$f":"IF(Working!$AH32=0,\"\",IF(Working!$AI32=M52,\"\",Working!$AL32))","v":1},null,null,{"$f":"IF(AND(R56=\"\",Q56=\"\"),\"\",\"=\")","v":"="},{"$f":"IF(Working!$AB42=0,\"0\",IF(Working!$AH42=0,\"\",Working!$AH42))","v":1},{"$f":"IF(Working!$AH42=0,\"\",IF(Working!$AI42=R52,\"\",Working!$AL42))","v":11},null,null,{"$f":"IF(AND(W56=\"\",V56=\"\"),\"\",\"=\")","v":""},{"$f":"IF(Working!$AB52=0,\"0\",IF(Working!$AH52=0,\"\",Working!$AH52))","v":""},{"$f":"IF(Working!$AH52=0,\"\",IF(Working!$AI52=W52,\"\",Working!$AL52))","v":""}]
[null,null,{"$f":"IF(Working!$AH12=0,\"\",IF(Working!$AI12=C52,\"\",Working!$AL13))","v":""},null,null,null,null,{"$f":"IF(Working!$AH22=0,\"\",IF(Working!$AI22=H52,\"\",Working!$AL23))","v":""},null,null,null,null,{"$f":"IF(Working!$AH32=0,\"\",IF(Working!$AI32=M52,\"\",Working!$AL33))","v":30},null,null,null,null,{"$f":"IF(Working!$AH42=0,\"\",IF(Working!$AI42=R52,\"\",Working!$AL43))","v":48},null,null,null,null,{"$f":"IF(Working!$AH52=0,\"\",IF(Working!$AI52=W52,\"\",Working!$AL53))","v":""}]

{"sheet":"Working","index":3,"n_rows":63,"n_cols":44,"rows_kept":63,"cut":false,"hidden":true,"merged":[]}
[{"$f":"INT(900*RAND()+100)","v":391},null,null,null,null,null,null,{"$f":"TEXT(A1,0)","v":"391"},null,"AFS - ",null,null,"SUBTRACTION OF FRACTIONS","SUBTRACTION OF FRACTIONS",null,null,"Max",3]
[null,null,null,null,null,null,null,"1st Fraction","2nd Fraction","2nd Fraction","Common",null,null,"1st Fraction",null,null,"2nd Fraction","Operation",null,"Subtraction swap",null,null,null,null,null,null,null,null,null,null,null,null,"Looks for 1/1"]
[null,null,null,null,null,null,null,"b",null,"d",null,null,null,"a",null,"c"]
[1,{"$f":"CONCATENATE(A4,\")\")","v":"1)"},{"$f":"IF($R$1=1,INT(5*RAND()),IF($R$1=2,INT(7*RAND()),INT(16*RAND()+1)))","v":16},{"$f":"IF($R$1=1,INT(5*RAND()),IF($R$1=2,INT(7*RAND()),INT(16*RAND()+1)))","v":3},{"$f":"IF(D4=C4,IF($R$1=1,INT(5*RAND()),IF($R$1=2,INT(7*RAND()),INT(16*RAND()+1))),D4)","v":3},{"$f":"IF(E4=C4,IF($R$1=1,INT(5*RAND()),IF($R$1=2,INT(7*RAND()),INT(16*RAND()+1))),E4)","v":3},{"$f":"IF(F4=C4,IF($R$1=1,INT(5*RAND()),IF($R$1=2,INT(7*RAND()),INT(16*RAND()+1))),F4)","v":3},{"$f":"IF(C4=0,2,IF(C4=1,4,IF(C4=2,5,IF(C4=3,8,IF(C4=4,10,IF(C4=5,3,IF(C4=6,6,C4)))))))","v":16},{"$f":"IF(G4=0,2,IF(G4=1,4,IF(G4=2,5,IF(G4=3,8,IF(G4=4,10,IF(G4=5,3,IF(G4=6,6,G4)))))))","v":8},{"$f":"IF(I4=H4,I4+1,I4)","v":8},{"$f":"H4*J4","v":128},{"$f":"IF(H4=2,1,INT(((K4-1)*RAND())/(I4-1)))","v":0},{"$f":"IF(L4=H4,L4+1,L4)","v":0},{"$f":"IF(M4=0,1,M4)","v":1},{"$f":"N4*J4","v":8},{"$f":"RANDBETWEEN(1,(2*J4-1))","v":6},{"$f":"P4*H4","v":96},1,{"$f":"IF(R4=0,\"+\",\"-\")","v":"-"},{"$f":"IF(AND(R4=1,Q4>O4),P4,N4)","v":6},{"$f":"S4","v":"-"},{"$f":"IF(AND(R4=1,Q4>O4),N4,P4)","v":1},"=",{"$f":"Q4","v":96},0,{"$f":"O4","v":8},"=",{"$f":"IF(R4=0,O4+Q4,ABS(O4-Q4))","v":88},{"$f":"IF(AB4>=AB5,\"Improper\",\"Proper\")","v":"Proper"},null,{"$f":"GCD(AB4,AB5)","v":8},{"$f":"AB4/AE4","v":11},null,{"$f":"INT(AF4/AF5)","v":0},{"$f":"IF(AB4=AB5,\"\",AF4-AH4*AF5)","v":11},{"$f":"AH4","v":0},{"$f":"AI4","v":11},{"$f":"IF(AK4=AF4,\"\",AK4)","v":""},null,{"$f":"CONCATENATE(AB4,\"/\",AB5)","v":"88/128"},"=",{"$f":"CONCATENATE(AF4,\"/\",AF5)","v":"11/16"},"=",{"$f":"IF(AH4=0,CONCATENATE(AI4,\"/\",AF5),CONCATENATE(AH4,\" \",AI4,\"/\",AF5))","v":"11/16"}]
[null,null,null,null,null,null,null,null,null,null,null,null,null,null,null,null,null,1,{"$f":"IF(R5=0,\"+\",\"-\")","v":"-"},{"$f":"IF(AND(R4=1,Q4>O4),J4,H4)","v":8},null,{"$f":"IF(AND(R4=1,Q4>O4),H4,J4)","v":16},null,{"$f":"K4","v":128},0,{"$f":"K4","v":128},null,{"$f":"K4","v":128},null,null,null,{"$f":"AB5/AE4","v":16},{"$f":"IF(AF5=AF4,\"\",AF5)","v":16},null,null,null,{"$f":"AF5","v":16},{"$f":"IF(OR(AK4=AF4,AK4=0),\"\",AK5)","v":""}]
[2,{"$f":"CONCATENATE(A6,\")\")","v":"2)"},{"$f":"IF($R$1=1,INT(5*RAND()),IF($R$1=2,INT(7*RAND()),INT(16*RAND()+1)))","v":8},{"$f":"IF($R$1=1,INT(5*RAND()),IF($R$1=2,INT(7*RAND()),INT(16*RAND()+1)))","v":5},{"$f":"IF(D6=C6,IF($R$1=1,INT(5*RAND()),IF($R$1=2,INT(7*RAND()),INT(16*RAND()+1))),D6)","v":5},{"$f":"IF(E6=C6,IF($R$1=1,INT(5*RAND()),IF($R$1=2,INT(7*RAND()),INT(16*RAND()+1))),E6)","v":5},{"$f":"IF(F6=C6,IF($R$1=1,INT(5*RAND()),IF($R$1=2,INT(7*RAND()),INT(16*RAND()+1))),F6)","v":5},{"$f":"IF(C6=0,2,IF(C6=1,4,IF(C6=2,5,IF(C6=3,8,IF(C6=4,10,IF(C6=5,3,IF(C6=6,6,C6)))))))","v":8},{"$f":"IF(G6=0,2,IF(G6=1,4,IF(G6=2,5,IF(G6=3,8,IF(G6=4,10,IF(G6=5,3,IF(G6=6,6,G6)))))))","v":3},{"$f":"IF(I6=H6,I6+1,I6)","v":3},{"$f":"H6*J6","v":24},{"$f":"IF(H6=2,1,INT(((K6-1)*RAND())/(I6-1)))","v":8},{"$f":"IF(L6=H6,L6+1,L6)","v":9},{"$f":"IF(M6=0,1,M6)","v":9},{"$f":"N6*J6","v":27},{"$f":"RANDBETWEEN(1,(2*J6-1))","v":3},{"$f":"P6*H6","v":24},1,"-",{"$f":"IF(AND(R6=1,Q6>O6),P6,N6)","v":9},{"$f":"S6","v":"-"},{"$f":"IF(AND(R6=1,Q6>O6),N6,P6)","v":3},"=",{"$f":"Q6","v":24},0,{"$f":"O6","v":27},"=",{"$f":"IF(R6=0,O6+Q6,ABS(O6-Q6))","v":3},{"$f":"IF(AB6>=AB7,\"Improper\",\"Proper\")","v":"Proper"},null,{"$f":"GCD(AB6,AB7)","v":3},{"$f":"AB6/AE6","v":1},null,{"$f":"INT(AF6/AF7)","v":0},{"$f":"IF(AB6=AB7,\"\",AF6-AH6*AF7)","v":1},{"$f":"AH6","v":0},{"$f":"AI6","v":1},{"$f":"IF(AK6=AF6,\"\",AK6)","v":""},null,{"$f":"CONCATENATE(AB6,\"/\",AB7)","v":"3/24"},"=",{"$f":"CONCATENATE(AF6,\"/\",AF7)","v":"1/8"},"=",{"$f":"IF(AH6=0,CONCATENATE(AI6,\"/\",AF7),CONCATENATE(AH6,\" \",AI6,\"/\",AF7))","v":"1/8"}]
[null,null,null,null,null,null,null,null,null,null,null,null,null,null,null,null,null,1,"-",{"$f":"IF(AND(R6=1,Q6>O6),J6,H6)","v":8},null,{"$f":"IF(AND(R6=1,Q6>O6),H6,J6)","v":3},null,{"$f":"K6","v":24},0,{"$f":"K6","v":24},null,{"$f":"K6","v":24},null,null,null,{"$f":"AB7/AE6","v":8},{"$f":"IF(AF7=AF6,\"\",AF7)","v":8},null,null,null,{"$f":"AF7","v":8},{"$f":"IF(OR(AK6=AF6,AK6=0),\"\",AK7)","v":""}]
[3,{"$f":"CONCATENATE(A8,\")\")","v":"3)"},{"$f":"IF($R$1=1,INT(5*RAND()),IF($R$1=2,INT(7*RAND()),INT(16*RAND()+1)))","v":6},{"$f":"IF($R$1=1,INT(5*RAND()),IF($R$1=2,INT(7*RAND()),INT(16*RAND()+1)))","v":16},{"$f":"IF(D8=C8,IF($R$1=1,INT(5*RAND()),IF($R$1=2,INT(7*RAND()),INT(16*RAND()+1))),D8)","v":16},{"$f":"IF(E8=C8,IF($R$1=1,INT(5*RAND()),IF($R$1=2,INT(7*RAND()),INT(16*RAND()+1))),E8)","v":16},{"$f":"IF(F8=C8,IF($R$1=1,INT(5*RAND()),IF($R$1=2,INT(7*RAND()),INT(16*RAND()+1))),F8)","v":16},{"$f":"IF(C8=0,2,IF(C8=1,4,IF(C8=2,5,IF(C8=3,8,IF(C8=4,10,IF(C8=5,3,IF(C8=6,6,C8)))))))","v":6},{"$f":"IF(G8=0,2,IF(G8=1,4,IF(G8=2,5,IF(G8=3,8,IF(G8=4,10,IF(G8=5,3,IF(G8=6,6,G8)))))))","v":16},{"$f":"IF(I8=H8,I8+1,I8)","v":16},{"$f":"H8*J8","v":96},{"$f":"IF(H8=2,1,INT(((K8-1)*RAND())/(I8-1)))","v":4},{"$f":"IF(L8=H8,L8+1,L8)","v":4},{"$f":"IF(M8=0,1,M8)","v":4},{"$f":"N8*J8","v":64},{"$f":"RANDBETWEEN(1,(2*J8-1))","v":5},{"$f":"P8*H8","v":30},1,"-",{"$f":"IF(AND(R8=1,Q8>O8),P8,N8)","v":4},{"$f":"S8","v":"-"},{"$f":"IF(AND(R8=1,Q8>O8),N8,P8)","v":5},"=",{"$f":"Q8","v":30},0,{"$f":"O8","v":64},"=",{"$f":"IF(R8=0,O8+Q8,ABS(O8-Q8))","v":34},{"$f":"IF(AB8>=AB9,\"Improper\",\"Proper\")","v":"Proper"},null,{"$f":"GCD(AB8,AB9)","v":2},{"$f":"AB8/AE8","v":17},null,{"$f":"INT(AF8/AF9)","v":0},{"$f":"IF(AB8=AB9,\"\",AF8-AH8*AF9)","v":17},{"$f":"AH8","v":0},{"$f":"AI8","v":17},{"$f":"IF(AK8=AF8,\"\",AK8)","v":""},null,{"$f":"CONCATENATE(AB8,\"/\",AB9)","v":"34/96"},"=",{"$f":"CONCATENATE(AF8,\"/\",AF9)","v":"17/48"},"=",{"$f":"IF(AH8=0,CONCATENATE(AI8,\"/\",AF9),CONCATENATE(AH8,\" \",AI8,\"/\",AF9))","v":"17/48"}]
[null,null,null,null,null,null,null,null,null,null,null,null,null,null,null,null,null,1,"-",{"$f":"IF(AND(R8=1,Q8>O8),J8,H8)","v":6},null,{"$f":"IF(AND(R8=1,Q8>O8),H8,J8)","v":16},null,{"$f":"K8","v":96},0,{"$f":"K8","v":96},null,{"$f":"K8","v":96},null,null,null,{"$f":"AB9/AE8","v":48},{"$f":"IF(AF9=AF8,\"\",AF9)","v":48},null,null,null,{"$f":"AF9","v":48},{"$f":"IF(OR(AK8=AF8,AK8=0),\"\",AK9)","v":""}]
[4,{"$f":"CONCATENATE(A10,\")\")","v":"4)"},{"$f":"IF($R$1=1,INT(5*RAND()),IF($R$1=2,INT(7*RAND()),INT(16*RAND()+1)))","v":15},{"$f":"IF($R$1=1,INT(5*RAND()),IF($R$1=2,INT(7*RAND()),INT(16*RAND()+1)))","v":4},{"$f":"IF(D10=C10,IF($R$1=1,INT(5*RAND()),IF($R$1=2,INT(7*RAND()),INT(16*RAND()+1))),D10)","v":4},{"$f":"IF(E10=C10,IF($R$1=1,INT(5*RAND()),IF($R$1=2,INT(7*RAND()),INT(16*RAND()+1))),E10)","v":4},{"$f":"IF(F10=C10,IF($R$1=1,INT(5*RAND()),IF($R$1=2,INT(7*RAND()),INT(16*RAND()+1))),F10)","v":4},{"$f":"IF(C10=0,2,IF(C10=1,4,IF(C10=2,5,IF(C10=3,8,IF(C10=4,10,IF(C10=5,3,IF(C10=6,6,C10)))))))","v":15},{"$f":"IF(G10=0,2,IF(G10=1,4,IF(G10=2,5,IF(G10=3,8,IF(G10=4,10,IF(G10=5,3,IF(G10=6,6,G10)))))))","v":10},{"$f":"IF(I10=H10,I10+1,I10)","v":10},{"$f":"H10*J10","v":150},{"$f":"IF(H10=2,1,INT(((K10-1)*RAND())/(I10-1)))","v":12},{"$f":"IF(L10=H10,L10+1,L10)","v":12},{"$f":"IF(M10=0,1,M10)","v":12},{"$f":"N10*J10","v":120},{"$f":"RANDBETWEEN(1,(2*J10-1))","v":18},{"$f":"P10*H10","v":270},1,"-",{"$f":"IF(AND(R10=1,Q10>O10),P10,N10)","v":18},{"$f":"S10","v":"-"},{"$f":"IF(AND(R10=1,Q10>O10),N10,P10)","v":12},"=",{"$f":"Q10","v":270},0,{"$f":"O10","v":120},"=",{"$f":"IF(R10=0,O10+Q10,ABS(O10-Q10))","v":150},{"$f":"IF(AB10>=AB11,\"Improper\",\"Proper\")","v":"Improper"},null,{"$f":"GCD(AB10,AB11)","v":150},{"$f":"AB10/AE10","v":1},null,{"$f":"INT(AF10/AF11)","v":1},{"$f":"IF(AB10=AB11,\"\",AF10-AH10*AF11)","v":""},{"$f":"AH10","v":1},{"$f":"AI10","v":""},{"$f":"IF(AK10=AF10,\"\",AK10)","v":""},null,{"$f":"CONCATENATE(AB10,\"/\",AB11)","v":"150/150"},"=",{"$f":"CONCATENATE(AF10,\"/\",AF11)","v":"1/1"},"=",{"$f":"IF(AH10=0,CONCATENATE(AI10,\"/\",AF11),CONCATENATE(AH10,\" \",AI10,\"/\",AF11))","v":"1 /1"}]
[null,null,null,null,null,null,null,null,null,null,null,null,null,null,null,null,null,1,"-",{"$f":"IF(AND(R10=1,Q10>O10),J10,H10)","v":10},null,{"$f":"IF(AND(R10=1,Q10>O10),H10,J10)","v":15},null,{"$f":"K10","v":150},0,{"$f":"K10","v":150},null,{"$f":"K10","v":150},null,null,null,{"$f":"AB11/AE10","v":1},{"$f":"IF(AF11=AF10,\"\",AF11)","v":""},null,null,null,{"$f":"AF11","v":1},{"$f":"IF(OR(AK10=AF10,AK10=0),\"\",AK11)","v":1}]
[5,{"$f":"CONCATENATE(A12,\")\")","v":"5)"},{"$f":"IF($R$1=1,INT(5*RAND()),IF($R$1=2,INT(7*RAND()),INT(16*RAND()+1)))","v":9},{"$f":"IF($R$1=1,INT(5*RAND()),IF($R$1=2,INT(7*RAND()),INT(16*RAND()+1)))","v":3},{"$f":"IF(D12=C12,IF($R$1=1,INT(5*RAND()),IF($R$1=2,INT(7*RAND()),INT(16*RAND()+1))),D12)","v":3},{"$f":"IF(E12=C12,IF($R$1=1,INT(5*RAND()),IF($R$1=2,INT(7*RAND()),INT(16*RAND()+1))),E12)","v":3},{"$f":"IF(F12=C12,IF($R$1=1,INT(5*RAND()),IF($R$1=2,INT(7*RAND()),INT(16*RAND()+1))),F12)","v":3},{"$f":"IF(C12=0,2,IF(C12=1,4,IF(C12=2,5,IF(C12=3,8,IF(C12=4,10,IF(C12=5,3,IF(C12=6,6,C12)))))))","v":9},{"$f":"IF(G12=0,2,IF(G12=1,4,IF(G12=2,5,IF(G12=3,8,IF(G12=4,10,IF(G12=5,3,IF(G12=6,6,G12)))))))","v":8},{"$f":"IF(I12=H12,I12+1,I12)","v":8},{"$f":"H12*J12","v":72},{"$f":"IF(H12=2,1,INT(((K12-1)*RAND())/(I12-1)))","v":1},{"$f":"IF(L12=H12,L12+1,L12)","v":1},{"$f":"IF(M12=0,1,M12)","v":1},{"$f":"N12*J12","v":8},{"$f":"RANDBETWEEN(1,(2*J12-1))","v":5},{"$f":"P12*H12","v":45},1,"-",{"$f":"IF(AND(R12=1,Q12>O12),P12,N12)","v":5},{"$f":"S12","v":"-"},{"$f":"IF(AND(R12=1,Q12>O12),N12,P12)","v":1},"=",{"$f":"Q12","v":45},0,{"$f":"O12","v":8},"=",{"$f":"IF(R12=0,O12+Q12,ABS(O12-Q12))","v":37},{"$f":"IF(AB12>=AB13,\"Improper\",\"Proper\")","v":"Proper"},null,{"$f":"GCD(AB12,AB13)","v":1},{"$f":"AB12/AE12","v":37},null,{"$f":"INT(AF12/AF13)","v":0},{"$f":"IF(AB12=AB13,\"\",AF12-AH12*AF13)","v":37},{"$f":"AH12","v":0},{"$f":"AI12","v":37},{"$f":"IF(AK12=AF12,\"\",AK12)","v":""},null,{"$f":"CONCATENATE(AB12,\"/\",AB13)","v":"37/72"},"=",{"$f":"CONCATENATE(AF12,\"/\",AF13)","v":"37/72"},"=",{"$f":"IF(AH12=0,CONCATENATE(AI12,\"/\",AF13),CONCATENATE(AH12,\" \",AI12,\"/\",AF13))","v":"37/72"}]
[null,null,null,null,null,null,null,null,null,null,null,null,null,null,null,null,null,1,"-",{"$f":"IF(AND(R12=1,Q12>O12),J12,H12)","v":8},null,{"$f":"IF(AND(R12=1,Q12>O12),H12,J12)","v":9},null,{"$f":"K12","v":72},0,{"$f":"K12","v":72},null,{"$f":"K12","v":72},null,null,null,{"$f":"AB13/AE12","v":72},{"$f":"IF(AF13=AF12,\"\",AF13)","v":72},null,null,null,{"$f":"AF13","v":72},{"$f":"IF(OR(AK12=AF12,AK12=0),\"\",AK13)","v":""}]
[6,{"$f":"CONCATENATE(A14,\")\")","v":"6)"},{"$f":"IF($R$1=1,INT(5*RAND()),IF($R$1=2,INT(7*RAND()),INT(16*RAND()+1)))","v":3},{"$f":"IF($R$1=1,INT(5*RAND()),IF($R$1=2,INT(7*RAND()),INT(16*RAND()+1)))","v":13},{"$f":"IF(D14=C14,IF($R$1=1,INT(5*RAND()),IF($R$1=2,INT(7*RAND()),INT(16*RAND()+1))),D14)","v":13},{"$f":"IF(E14=C14,IF($R$1=1,INT(5*RAND()),IF($R$1=2,INT(7*RAND()),INT(16*RAND()+1))),E14)","v":13},{"$f":"IF(F14=C14,IF($R$1=1,INT(5*RAND()),IF($R$1=2,INT(7*RAND()),INT(16*RAND()+1))),F14)","v":13},{"$f":"IF(C14=0,2,IF(C14=1,4,IF(C14=2,5,IF(C14=3,8,IF(C14=4,10,IF(C14=5,3,IF(C14=6,6,C14)))))))","v":8},{"$f":"IF(G14=0,2,IF(G14=1,4,IF(G14=2,5,IF(G14=3,8,IF(G14=4,10,IF(G14=5,3,IF(G14=6,6,G14)))))))","v":13},{"$f":"IF(I14=H14,I14+1,I14)","v":13},{"$f":"H14*J14","v":104},{"$f":"IF(H14=2,1,INT(((K14-1)*RAND())/(I14-1)))","v":3},{"$f":"IF(L14=H14,L14+1,L14)","v":3},{"$f":"IF(M14=0,1,M14)","v":3},{"$f":"N14*J14","v":39},{"$f":"RANDBETWEEN(1,(2*J14-1))","v":17},{"$f":"P14*H14","v":136},1,"-",{"$f":"IF(AND(R14=1,Q14>O14),P14,N14)","v":17},{"$f":"S14","v":"-"},{"$f":"IF(AND(R14=1,Q14>O14),N14,P14)","v":3},"=",{"$f":"Q14","v":136},0,{"$f":"O14","v":39},"=",{"$f":"IF(R14=0,O14+Q14,ABS(O14-Q14))","v":97},{"$f":"IF(AB14>=AB15,\"Improper\",\"Proper\")","v":"Proper"},null,{"$f":"GCD(AB14,AB15)","v":1},{"$f":"AB14/AE14","v":97},null,{"$f":"INT(AF14/AF15)","v":0},{"$f":"IF(AB14=AB15,\"\",AF14-AH14*AF15)","v":97},{"$f":"AH14","v":0},{"$f":"AI14","v":97},{"$f":"IF(AK14=AF14,\"\",AK14)","v":""},null,{"$f":"CONCATENATE(AB14,\"/\",AB15)","v":"97/104"},"=",{"$f":"CONCATENATE(AF14,\"/\",AF15)","v":"97/104"},"=",{"$f":"IF(AH14=0,CONCATENATE(AI14,\"/\",AF15),CONCATENATE(AH14,\" \",AI14,\"/\",AF15))","v":"97/104"}]
[null,null,null,null,null,null,null,null,null,null,null,null,null,null,null,null,null,1,"-",{"$f":"IF(AND(R14=1,Q14>O14),J14,H14)","v":13},null,{"$f":"IF(AND(R14=1,Q14>O14),H14,J14)","v":8},null,{"$f":"K14","v":104},0,{"$f":"K14","v":104},null,{"$f":"K14","v":104},null,null,null,{"$f":"AB15/AE14","v":104},{"$f":"IF(AF15=AF14,\"\",AF15)","v":104},null,null,null,{"$f":"AF15","v":104},{"$f":"IF(OR(AK14=AF14,AK14=0),\"\",AK15)","v":""}]
[7,{"$f":"CONCATENATE(A16,\")\")","v":"7)"},{"$f":"IF($R$1=1,INT(5*RAND()),IF($R$1=2,INT(7*RAND()),INT(16*RAND()+1)))","v":6},{"$f":"IF($R$1=1,INT(5*RAND()),IF($R$1=2,INT(7*RAND()),INT(16*RAND()+1)))","v":11},{"$f":"IF(D16=C16,IF($R$1=1,INT(5*RAND()),IF($R$1=2,INT(7*RAND()),INT(16*RAND()+1))),D16)","v":11},{"$f":"IF(E16=C16,IF($R$1=1,INT(5*RAND()),IF($R$1=2,INT(7*RAND()),INT(16*RAND()+1))),E16)","v":11},{"$f":"IF(F16=C16,IF($R$1=1,INT(5*RAND()),IF($R$1=2,INT(7*RAND()),INT(16*RAND()+1))),F16)","v":11},{"$f":"IF(C16=0,2,IF(C16=1,4,IF(C16=2,5,IF(C16=3,8,IF(C16=4,10,IF(C16=5,3,IF(C16=6,6,C16)))))))","v":6},{"$f":"IF(G16=0,2,IF(G16=1,4,IF(G16=2,5,IF(G16=3,8,IF(G16=4,10,IF(G16=5,3,IF(G16=6,6,G16)))))))","v":11},{"$f":"IF(I16=H16,I16+1,I16)","v":11},{"$f":"H16*J16","v":66},{"$f":"IF(H16=2,1,INT(((K16-1)*RAND())/(I16-1)))","v":0},{"$f":"IF(L16=H16,L16+1,L16)","v":0},{"$f":"IF(M16=0,1,M16)","v":1},{"$f":"N16*J16","v":11},{"$f":"RANDBETWEEN(1,(2*J16-1))","v":2},{"$f":"P16*H16","v":12},1,"-",{"$f":"IF(AND(R16=1,Q16>O16),P16,N16)","v":2},{"$f":"S16","v":"-"},{"$f":"IF(AND(R16=1,Q16>O16),N16,P16)","v":1},"=",{"$f":"Q16","v":12},0,{"$f":"O16","v":11},"=",{"$f":"IF(R16=0,O16+Q16,ABS(O16-Q16))","v":1},{"$f":"IF(AB16>=AB17,\"Improper\",\"Proper\")","v":"Proper"},null,{"$f":"GCD(AB16,AB17)","v":1},{"$f":"AB16/AE16","v":1},null,{"$f":"INT(AF16/AF17)","v":0},{"$f":"IF(AB16=AB17,\"\",AF16-AH16*AF17)","v":1},{"$f":"AH16","v":0},{"$f":"AI16","v":1},{"$f":"IF(AK16=AF16,\"\",AK16)","v":""},null,{"$f":"CONCATENATE(AB16,\"/\",AB17)","v":"1/66"},"=",{"$f":"CONCATENATE(AF16,\"/\",AF17)","v":"1/66"},"=",{"$f":"IF(AH16=0,CONCATENATE(AI16,\"/\",AF17),CONCATENATE(AH16,\" \",AI16,\"/\",AF17))","v":"1/66"}]
[null,null,null,null,null,null,null,null,null,null,null,null,null,null,null,null,null,1,"-",{"$f":"IF(AND(R16=1,Q16>O16),J16,H16)","v":11},null,{"$f":"IF(AND(R16=1,Q16>O16),H16,J16)","v":6},null,{"$f":"K16","v":66},0,{"$f":"K16","v":66},null,{"$f":"K16","v":66},null,null,null,{"$f":"AB17/AE16","v":66},{"$f":"IF(AF17=AF16,\"\",AF17)","v":66},null,null,null,{"$f":"AF17","v":66},{"$f":"IF(OR(AK16=AF16,AK16=0),\"\",AK17)","v":""}]
[8,{"$f":"CONCATENATE(A18,\")\")","v":"8)"},{"$f":"IF($R$1=1,INT(5*RAND()),IF($R$1=2,INT(7*RAND()),INT(16*RAND()+1)))","v":5},{"$f":"IF($R$1=1,INT(5*RAND()),IF($R$1=2,INT(7*RAND()),INT(16*RAND()+1)))","v":9},{"$f":"IF(D18=C18,IF($R$1=1,INT(5*RAND()),IF($R$1=2,INT(7*RAND()),INT(16*RAND()+1))),D18)","v":9},{"$f":"IF(E18=C18,IF($R$1=1,INT(5*RAND()),IF($R$1=2,INT(7*RAND()),INT(16*RAND()+1))),E18)","v":9},{"$f":"IF(F18=C18,IF($R$1=1,INT(5*RAND()),IF($R$1=2,INT(7*RAND()),INT(16*RAND()+1))),F18)","v":9},{"$f":"IF(C18=0,2,IF(C18=1,4,IF(C18=2,5,IF(C18=3,8,IF(C18=4,10,IF(C18=5,3,IF(C18=6,6,C18)))))))","v":3},{"$f":"IF(G18=0,2,IF(G18=1,4,IF(G18=2,5,IF(G18=3,8,IF(G18=4,10,IF(G18=5,3,IF(G18=6,6,G18)))))))","v":9},{"$f":"IF(I18=H18,I18+1,I18)","v":9},{"$f":"H18*J18","v":27},{"$f":"IF(H18=2,1,INT(((K18-1)*RAND())/(I18-1)))","v":1},{"$f":"IF(L18=H18,L18+1,L18)","v":1},{"$f":"IF(M18=0,1,M18)","v":1},{"$f":"N18*J18","v":9},{"$f":"RANDBETWEEN(1,(2*J18-1))","v":3},{"$f":"P18*H18","v":9},1,"-",{"$f":"IF(AND(R18=1,Q18>O18),P18,N18)","v":1},{"$f":"S18","v":"-"},{"$f":"IF(AND(R18=1,Q18>O18),N18,P18)","v":3},"=",{"$f":"Q18","v":9},0,{"$f":"O18","v":9},"=",{"$f":"IF(R18=0,O18+Q18,ABS(O18-Q18))","v":0},{"$f":"IF(AB18>=AB19,\"Improper\",\"Proper\")","v":"Proper"},null,{"$f":"GCD(AB18,AB19)","v":27},{"$f":"AB18/AE18","v":0},null,{"$f":"INT(AF18/AF19)","v":0},{"$f":"IF(AB18=AB19,\"\",AF18-AH18*AF19)","v":0},{"$f":"AH18","v":0},{"$f":"AI18","v":0},{"$f":"IF(AK18=AF18,\"\",AK18)","v":""},null,{"$f":"CONCATENATE(AB18,\"/\",AB19)","v":"0/27"},"=",{"$f":"CONCATENATE(AF18,\"/\",AF19)","v":"0/1"},"=",{"$f":"IF(AH18=0,CONCATENATE(AI18,\"/\",AF19),CONCATENATE(AH18,\" \",AI18,\"/\",AF19))","v":"0/1"}]
[null,null,null,null,null,null,null,null,null,null,null,null,null,null,null,null,null,1,"-",{"$f":"IF(AND(R18=1,Q18>O18),J18,H18)","v":3},null,{"$f":"IF(AND(R18=1,Q18>O18),H18,J18)","v":9},null,{"$f":"K18","v":27},0,{"$f":"K18","v":27},null,{"$f":"K18","v":27},null,null,null,{"$f":"AB19/AE18","v":1},{"$f":"IF(AF19=AF18,\"\",AF19)","v":1},null,null,null,{"$f":"AF19","v":1},{"$f":"IF(OR(AK18=AF18,AK18=0),\"\",AK19)","v":""}]
[9,{"$f":"CONCATENATE(A20,\")\")","v":"9)"},{"$f":"IF($R$1=1,INT(5*RAND()),IF($R$1=2,INT(7*RAND()),INT(16*RAND()+1)))","v":7},{"$f":"IF($R$1=1,INT(5*RAND()),IF($R$1=2,INT(7*RAND()),INT(16*RAND()+1)))","v":4},{"$f":"IF(D20=C20,IF($R$1=1,INT(5*RAND()),IF($R$1=2,INT(7*RAND()),INT(16*RAND()+1))),D20)","v":4},{"$f":"IF(E20=C20,IF($R$1=1,INT(5*RAND()),IF($R$1=2,INT(7*RAND()),INT(16*RAND()+1))),E20)","v":4},{"$f":"IF(F20=C20,IF($R$1=1,INT(5*RAND()),IF($R$1=2,INT(7*RAND()),INT(16*RAND()+1))),F20)","v":4},{"$f":"IF(C20=0,2,IF(C20=1,4,IF(C20=2,5,IF(C20=3,8,IF(C20=4,10,IF(C20=5,3,IF(C20=6,6,C20)))))))","v":7},{"$f":"IF(G20=0,2,IF(G20=1,4,IF(G20=2,5,IF(G20=3,8,IF(G20=4,10,IF(G20=5,3,IF(G20=6,6,G20)))))))","v":10},{"$f":"IF(I20=H20,I20+1,I20)","v":10},{"$f":"H20*J20","v":70},{"$f":"IF(H20=2,1,INT(((K20-1)*RAND())/(I20-1)))","v":6},{"$f":"IF(L20=H20,L20+1,L20)","v":6},{"$f":"IF(M20=0,1,M20)","v":6},{"$f":"N20*J20","v":60},{"$f":"RANDBETWEEN(1,(2*J20-1))","v":17},{"$f":"P20*H20","v":119},1,"-",{"$f":"IF(AND(R20=1,Q20>O20),P20,N20)","v":17},{"$f":"S20","v":"-"},{"$f":"IF(AND(R20=1,Q20>O20),N20,P20)","v":6},"=",{"$f":"Q20","v":119},0,{"$f":"O20","v":60},"=",{"$f":"IF(R20=0,O20+Q20,ABS(O20-Q20))","v":59},{"$f":"IF(AB20>=AB21,\"Improper\",\"Proper\")","v":"Proper"},null,{"$f":"GCD(AB20,AB21)","v":1},{"$f":"AB20/AE20","v":59},null,{"$f":"INT(AF20/AF21)","v":0},{"$f":"IF(AB20=AB21,\"\",AF20-AH20*AF21)","v":59},{"$f":"AH20","v":0},{"$f":"AI20","v":59},{"$f":"IF(AK20=AF20,\"\",AK20)","v":""},null,{"$f":"CONCATENATE(AB20,\"/\",AB21)","v":"59/70"},"=",{"$f":"CONCATENATE(AF20,\"/\",AF21)","v":"59/70"},"=",{"$f":"IF(AH20=0,CONCATENATE(AI20,\"/\",AF21),CONCATENATE(AH20,\" \",AI20,\"/\",AF21))","v":"59/70"}]
[null,null,null,null,null,null,null,null,null,null,null,null,null,null,null,null,null,1,"-",{"$f":"IF(AND(R20=1,Q20>O20),J20,H20)","v":10},null,{"$f":"IF(AND(R20=1,Q20>O20),H20,J20)","v":7},null,{"$f":"K20","v":70},0,{"$f":"K20","v":70},null,{"$f":"K20","v":70},null,null,null,{"$f":"AB21/AE20","v":70},{"$f":"IF(AF21=AF20,\"\",AF21)","v":70},null,null,null,{"$f":"AF21","v":70},{"$f":"IF(OR(AK20=AF20,AK20=0),\"\",AK21)","v":""}]
[10,{"$f":"CONCATENATE(A22,\")\")","v":"10)"},{"$f":"IF($R$1=1,INT(5*RAND()),IF($R$1=2,INT(7*RAND()),INT(16*RAND()+1)))","v":15},{"$f":"IF($R$1=1,INT(5*RAND()),IF($R$1=2,INT(7*RAND()),INT(16*RAND()+1)))","v":9},{"$f":"IF(D22=C22,IF($R$1=1,INT(5*RAND()),IF($R$1=2,INT(7*RAND()),INT(16*RAND()+1))),D22)","v":9},{"$f":"IF(E22=C22,IF($R$1=1,INT(5*RAND()),IF($R$1=2,INT(7*RAND()),INT(16*RAND()+1))),E22)","v":9},{"$f":"IF(F22=C22,IF($R$1=1,INT(5*RAND()),IF($R$1=2,INT(7*RAND()),INT(16*RAND()+1))),F22)","v":9},{"$f":"IF(C22=0,2,IF(C22=1,4,IF(C22=2,5,IF(C22=3,8,IF(C22=4,10,IF(C22=5,3,IF(C22=6,6,C22)))))))","v":15},{"$f":"IF(G22=0,2,IF(G22=1,4,IF(G22=2,5,IF(G22=3,8,IF(G22=4,10,IF(G22=5,3,IF(G22=6,6,G22)))))))","v":9},{"$f":"IF(I22=H22,I22+1,I22)","v":9},{"$f":"H22*J22","v":135},{"$f":"IF(H22=2,1,INT(((K22-1)*RAND())/(I22-1)))","v":11},{"$f":"IF(L22=H22,L22+1,L22)","v":11},{"$f":"IF(M22=0,1,M22)","v":11},{"$f":"N22*J22","v":99},{"$f":"RANDBETWEEN(1,(2*J22-1))","v":6},{"$f":"P22*H22","v":90},1,"-",{"$f":"IF(AND(R22=1,Q22>O22),P22,N22)","v":11},{"$f":"S22","v":"-"},{"$f":"IF(AND(R22=1,Q22>O22),N22,P22)","v":6},"=",{"$f":"Q22","v":90},0,{"$f":"O22","v":99},"=",{"$f":"IF(R22=0,O22+Q22,ABS(O22-Q22))","v":9},{"$f":"IF(AB22>=AB23,\"Improper\",\"Proper\")","v":"Proper"},null,{"$f":"GCD(AB22,AB23)","v":9},{"$f":"AB22/AE22","v":1},null,{"$f":"INT(AF22/AF23)","v":0},{"$f":"IF(AB22=AB23,\"\",AF22-AH22*AF23)","v":1},{"$f":"AH22","v":0},{"$f":"AI22","v":1},{"$f":"IF(AK22=AF22,\"\",AK22)","v":""},null,{"$f":"CONCATENATE(AB22,\"/\",AB23)","v":"9/135"},"=",{"$f":"CONCATENATE(AF22,\"/\",AF23)","v":"1/15"},"=",{"$f":"IF(AH22=0,CONCATENATE(AI22,\"/\",AF23),CONCATENATE(AH22,\" \",AI22,\"/\",AF23))","v":"1/15"}]
[null,null,null,null,null,null,null,null,null,null,null,null,null,null,null,null,null,1,"-",{"$f":"IF(AND(R22=1,Q22>O22),J22,H22)","v":15},null,{"$f":"IF(AND(R22=1,Q22>O22),H22,J22)","v":9},null,{"$f":"K22","v":135},0,{"$f":"K22","v":135},null,{"$f":"K22","v":135},null,null,null,{"$f":"AB23/AE22","v":15},{"$f":"IF(AF23=AF22,\"\",AF23)","v":15},null,null,null,{"$f":"AF23","v":15},{"$f":"IF(OR(AK22=AF22,AK22=0),\"\",AK23)","v":""}]
[11,{"$f":"CONCATENATE(A24,\")\")","v":"11)"},{"$f":"IF($R$1=1,INT(5*RAND()),IF($R$1=2,INT(7*RAND()),INT(16*RAND()+1)))","v":12},{"$f":"IF($R$1=1,INT(5*RAND()),IF($R$1=2,INT(7*RAND()),INT(16*RAND()+1)))","v":15},{"$f":"IF(D24=C24,IF($R$1=1,INT(5*RAND()),IF($R$1=2,INT(7*RAND()),INT(16*RAND()+1))),D24)","v":15},{"$f":"IF(E24=C24,IF($R$1=1,INT(5*RAND()),IF($R$1=2,INT(7*RAND()),INT(16*RAND()+1))),E24)","v":15},{"$f":"IF(F24=C24,IF($R$1=1,INT(5*RAND()),IF($R$1=2,INT(7*RAND()),INT(16*RAND()+1))),F24)","v":15},{"$f":"IF(C24=0,2,IF(C24=1,4,IF(C24=2,5,IF(C24=3,8,IF(C24=4,10,IF(C24=5,3,IF(C24=6,6,C24)))))))","v":12},{"$f":"IF(G24=0,2,IF(G24=1,4,IF(G24=2,5,IF(G24=3,8,IF(G24=4,10,IF(G24=5,3,IF(G24=6,6,G24)))))))","v":15},{"$f":"IF(I24=H24,I24+1,I24)","v":15},{"$f":"H24*J24","v":180},{"$f":"IF(H24=2,1,INT(((K24-1)*RAND())/(I24-1)))","v":6},{"$f":"IF(L24=H24,L24+1,L24)","v":6},{"$f":"IF(M24=0,1,M24)","v":6},{"$f":"N24*J24","v":90},{"$f":"RANDBETWEEN(1,(2*J24-1))","v":19},{"$f":"P24*H24","v":228},1,"-",{"$f":"IF(AND(R24=1,Q24>O24),P24,N24)","v":19},{"$f":"S24","v":"-"},{"$f":"IF(AND(R24=1,Q24>O24),N24,P24)","v":6},"=",{"$f":"Q24","v":228},0,{"$f":"O24","v":90},"=",{"$f":"IF(R24=0,O24+Q24,ABS(O24-Q24))","v":138},{"$f":"IF(AB24>=AB25,\"Improper\",\"Proper\")","v":"Proper"},null,{"$f":"GCD(AB24,AB25)","v":6},{"$f":"AB24/AE24","v":23},null,{"$f":"INT(AF24/AF25)","v":0},{"$f":"IF(AB24=AB25,\"\",AF24-AH24*AF25)","v":23},{"$f":"AH24","v":0},{"$f":"AI24","v":23},{"$f":"IF(AK24=AF24,\"\",AK24)","v":""},null,{"$f":"CONCATENATE(AB24,\"/\",AB25)","v":"138/180"},"=",{"$f":"CONCATENATE(AF24,\"/\",AF25)","v":"23/30"},"=",{"$f":"IF(AH24=0,CONCATENATE(AI24,\"/\",AF25),CONCATENATE(AH24,\" \",AI24,\"/\",AF25))","v":"23/30"}]
[null,null,null,null,null,null,null,null,null,null,null,null,null,null,null,null,null,1,"-",{"$f":"IF(AND(R24=1,Q24>O24),J24,H24)","v":15},null,{"$f":"IF(AND(R24=1,Q24>O24),H24,J24)","v":12},null,{"$f":"K24","v":180},0,{"$f":"K24","v":180},null,{"$f":"K24","v":180},null,null,null,{"$f":"AB25/AE24","v":30},{"$f":"IF(AF25=AF24,\"\",AF25)","v":30},null,null,null,{"$f":"AF25","v":30},{"$f":"IF(OR(AK24=AF24,AK24=0),\"\",AK25)","v":""}]
[12,{"$f":"CONCATENATE(A26,\")\")","v":"12)"},{"$f":"IF($R$1=1,INT(5*RAND()),IF($R$1=2,INT(7*RAND()),INT(16*RAND()+1)))","v":9},{"$f":"IF($R$1=1,INT(5*RAND()),IF($R$1=2,INT(7*RAND()),INT(16*RAND()+1)))","v":1},{"$f":"IF(D26=C26,IF($R$1=1,INT(5*RAND()),IF($R$1=2,INT(7*RAND()),INT(16*RAND()+1))),D26)","v":1},{"$f":"IF(E26=C26,IF($R$1=1,INT(5*RAND()),IF($R$1=2,INT(7*RAND()),INT(16*RAND()+1))),E26)","v":1},{"$f":"IF(F26=C26,IF($R$1=1,INT(5*RAND()),IF($R$1=2,INT(7*RAND()),INT(16*RAND()+1))),F26)","v":1},{"$f":"IF(C26=0,2,IF(C26=1,4,IF(C26=2,5,IF(C26=3,8,IF(C26=4,10,IF(C26=5,3,IF(C26=6,6,C26)))))))","v":9},{"$f":"IF(G26=0,2,IF(G26=1,4,IF(G26=2,5,IF(G26=3,8,IF(G26=4,10,IF(G26=5,3,IF(G26=6,6,G26)))))))","v":4},{"$f":"IF(I26=H26,I26+1,I26)","v":4},{"$f":"H26*J26","v":36},{"$f":"IF(H26=2,1,INT(((K26-1)*RAND())/(I26-1)))","v":2},{"$f":"IF(L26=H26,L26+1,L26)","v":2},{"$f":"IF(M26=0,1,M26)","v":2},{"$f":"N26*J26","v":8},{"$f":"RANDBETWEEN(1,(2*J26-1))","v":4},{"$f":"P26*H26","v":36},1,"-",{"$f":"IF(AND(R26=1,Q26>O26),P26,N26)","v":4},{"$f":"S26","v":"-"},{"$f":"IF(AND(R26=1,Q26>O26),N26,P26)","v":2},"=",{"$f":"Q26","v":36},0,{"$f":"O26","v":8},"=",{"$f":"IF(R26=0,O26+Q26,ABS(O26-Q26))","v":28},{"$f":"IF(AB26>=AB27,\"Improper\",\"Proper\")","v":"Proper"},null,{"$f":"GCD(AB26,AB27)","v":4},{"$f":"AB26/AE26","v":7},null,{"$f":"INT(AF26/AF27)","v":0},{"$f":"IF(AB26=AB27,\"\",AF26-AH26*AF27)","v":7},{"$f":"AH26","v":0},{"$f":"AI26","v":7},{"$f":"IF(AK26=AF26,\"\",AK26)","v":""},null,{"$f":"CONCATENATE(AB26,\"/\",AB27)","v":"28/36"},"=",{"$f":"CONCATENATE(AF26,\"/\",AF27)","v":"7/9"},"=",{"$f":"IF(AH26=0,CONCATENATE(AI26,\"/\",AF27),CONCATENATE(AH26,\" \",AI26,\"/\",AF27))","v":"7/9"}]
[null,null,null,null,null,null,null,null,null,null,null,null,null,null,null,null,null,1,"-",{"$f":"IF(AND(R26=1,Q26>O26),J26,H26)","v":4},null,{"$f":"IF(AND(R26=1,Q26>O26),H26,J26)","v":9},null,{"$f":"K26","v":36},0,{"$f":"K26","v":36},null,{"$f":"K26","v":36},null,null,null,{"$f":"AB27/AE26","v":9},{"$f":"IF(AF27=AF26,\"\",AF27)","v":9},null,null,null,{"$f":"AF27","v":9},{"$f":"IF(OR(AK26=AF26,AK26=0),\"\",AK27)","v":""}]
[13,{"$f":"CONCATENATE(A28,\")\")","v":"13)"},{"$f":"IF($R$1=1,INT(5*RAND()),IF($R$1=2,INT(7*RAND()),INT(16*RAND()+1)))","v":7},{"$f":"IF($R$1=1,INT(5*RAND()),IF($R$1=2,INT(7*RAND()),INT(16*RAND()+1)))","v":5},{"$f":"IF(D28=C28,IF($R$1=1,INT(5*RAND()),IF($R$1=2,INT(7*RAND()),INT(16*RAND()+1))),D28)","v":5},{"$f":"IF(E28=C28,IF($R$1=1,INT(5*RAND()),IF($R$1=2,INT(7*RAND()),INT(16*RAND()+1))),E28)","v":5},{"$f":"IF(F28=C28,IF($R$1=1,INT(5*RAND()),IF($R$1=2,INT(7*RAND()),INT(16*RAND()+1))),F28)","v":5},{"$f":"IF(C28=0,2,IF(C28=1,4,IF(C28=2,5,IF(C28=3,8,IF(C28=4,10,IF(C28=5,3,IF(C28=6,6,C28)))))))","v":7},{"$f":"IF(G28=0,2,IF(G28=1,4,IF(G28=2,5,IF(G28=3,8,IF(G28=4,10,IF(G28=5,3,IF(G28=6,6,G28)))))))","v":3},{"$f":"IF(I28=H28,I28+1,I28)","v":3},{"$f":"H28*J28","v":21},{"$f":"IF(H28=2,1,INT(((K28-1)*RAND())/(I28-1)))","v":3},{"$f":"IF(L28=H28,L28+1,L28)","v":3},{"$f":"IF(M28=0,1,M28)","v":3},{"$f":"N28*J28","v":9},{"$f":"RANDBETWEEN(1,(2*J28-1))","v":4},{"$f":"P28*H28","v":28},1,"-",{"$f":"IF(AND(R28=1,Q28>O28),P28,N28)","v":4},{"$f":"S28","v":"-"},{"$f":"IF(AND(R28=1,Q28>O28),N28,P28)","v":3},"=",{"$f":"Q28","v":28},0,{"$f":"O28","v":9},"=",{"$f":"IF(R28=0,O28+Q28,ABS(O28-Q28))","v":19},{"$f":"IF(AB28>=AB29,\"Improper\",\"Proper\")","v":"Proper"},null,{"$f":"GCD(AB28,AB29)","v":1},{"$f":"AB28/AE28","v":19},null,{"$f":"INT(AF28/AF29)","v":0},{"$f":"IF(AB28=AB29,\"\",AF28-AH28*AF29)","v":19},{"$f":"AH28","v":0},{"$f":"AI28","v":19},{"$f":"IF(AK28=AF28,\"\",AK28)","v":""},null,{"$f":"CONCATENATE(AB28,\"/\",AB29)","v":"19/21"},"=",{"$f":"CONCATENATE(AF28,\"/\",AF29)","v":"19/21"},"=",{"$f":"IF(AH28=0,CONCATENATE(AI28,\"/\",AF29),CONCATENATE(AH28,\" \",AI28,\"/\",AF29))","v":"19/21"}]
[null,null,null,null,null,null,null,null,null,null,null,null,null,null,null,null,null,1,"-",{"$f":"IF(AND(R28=1,Q28>O28),J28,H28)","v":3},null,{"$f":"IF(AND(R28=1,Q28>O28),H28,J28)","v":7},null,{"$f":"K28","v":21},0,{"$f":"K28","v":21},null,{"$f":"K28","v":21},null,null,null,{"$f":"AB29/AE28","v":21},{"$f":"IF(AF29=AF28,\"\",AF29)","v":21},null,null,null,{"$f":"AF29","v":21},{"$f":"IF(OR(AK28=AF28,AK28=0),\"\",AK29)","v":""}]
[14,{"$f":"CONCATENATE(A30,\")\")","v":"14)"},{"$f":"IF($R$1=1,INT(5*RAND()),IF($R$1=2,INT(7*RAND()),INT(16*RAND()+1)))","v":7},{"$f":"IF($R$1=1,INT(5*RAND()),IF($R$1=2,INT(7*RAND()),INT(16*RAND()+1)))","v":15},{"$f":"IF(D30=C30,IF($R$1=1,INT(5*RAND()),IF($R$1=2,INT(7*RAND()),INT(16*RAND()+1))),D30)","v":15},{"$f":"IF(E30=C30,IF($R$1=1,INT(5*RAND()),IF($R$1=2,INT(7*RAND()),INT(16*RAND()+1))),E30)","v":15},{"$f":"IF(F30=C30,IF($R$1=1,INT(5*RAND()),IF($R$1=2,INT(7*RAND()),INT(16*RAND()+1))),F30)","v":15},{"$f":"IF(C30=0,2,IF(C30=1,4,IF(C30=2,5,IF(C30=3,8,IF(C30=4,10,IF(C30=5,3,IF(C30=6,6,C30)))))))","v":7},{"$f":"IF(G30=0,2,IF(G30=1,4,IF(G30=2,5,IF(G30=3,8,IF(G30=4,10,IF(G30=5,3,IF(G30=6,6,G30)))))))","v":15},{"$f":"IF(I30=H30,I30+1,I30)","v":15},{"$f":"H30*J30","v":105},{"$f":"IF(H30=2,1,INT(((K30-1)*RAND())/(I30-1)))","v":4},{"$f":"IF(L30=H30,L30+1,L30)","v":4},{"$f":"IF(M30=0,1,M30)","v":4},{"$f":"N30*J30","v":60},{"$f":"RANDBETWEEN(1,(2*J30-1))","v":8},{"$f":"P30*H30","v":56},1,"-",{"$f":"IF(AND(R30=1,Q30>O30),P30,N30)","v":4},{"$f":"S30","v":"-"},{"$f":"IF(AND(R30=1,Q30>O30),N30,P30)","v":8},"=",{"$f":"Q30","v":56},0,{"$f":"O30","v":60},"=",{"$f":"IF(R30=0,O30+Q30,ABS(O30-Q30))","v":4},{"$f":"IF(AB30>=AB31,\"Improper\",\"Proper\")","v":"Proper"},null,{"$f":"GCD(AB30,AB31)","v":1},{"$f":"AB30/AE30","v":4},null,{"$f":"INT(AF30/AF31)","v":0},{"$f":"IF(AB30=AB31,\"\",AF30-AH30*AF31)","v":4},{"$f":"AH30","v":0},{"$f":"AI30","v":4},{"$f":"IF(AK30=AF30,\"\",AK30)","v":""},null,{"$f":"CONCATENATE(AB30,\"/\",AB31)","v":"4/105"},"=",{"$f":"CONCATENATE(AF30,\"/\",AF31)","v":"4/105"},"=",{"$f":"IF(AH30=0,CONCATENATE(AI30,\"/\",AF31),CONCATENATE(AH30,\" \",AI30,\"/\",AF31))","v":"4/105"}]
[null,null,null,null,null,null,null,null,null,null,null,null,null,null,null,null,null,1,"-",{"$f":"IF(AND(R30=1,Q30>O30),J30,H30)","v":7},null,{"$f":"IF(AND(R30=1,Q30>O30),H30,J30)","v":15},null,{"$f":"K30","v":105},0,{"$f":"K30","v":105},null,{"$f":"K30","v":105},null,null,null,{"$f":"AB31/AE30","v":105},{"$f":"IF(AF31=AF30,\"\",AF31)","v":105},null,null,null,{"$f":"AF31","v":105},{"$f":"IF(OR(AK30=AF30,AK30=0),\"\",AK31)","v":""}]
[15,{"$f":"CONCATENATE(A32,\")\")","v":"15)"},{"$f":"IF($R$1=1,INT(5*RAND()),IF($R$1=2,INT(7*RAND()),INT(16*RAND()+1)))","v":12},{"$f":"IF($R$1=1,INT(5*RAND()),IF($R$1=2,INT(7*RAND()),INT(16*RAND()+1)))","v":15},{"$f":"IF(D32=C32,IF($R$1=1,INT(5*RAND()),IF($R$1=2,INT(7*RAND()),INT(16*RAND()+1))),D32)","v":15},{"$f":"IF(E32=C32,IF($R$1=1,INT(5*RAND()),IF($R$1=2,INT(7*RAND()),INT(16*RAND()+1))),E32)","v":15},{"$f":"IF(F32=C32,IF($R$1=1,INT(5*RAND()),IF($R$1=2,INT(7*RAND()),INT(16*RAND()+1))),F32)","v":15},{"$f":"IF(C32=0,2,IF(C32=1,4,IF(C32=2,5,IF(C32=3,8,IF(C32=4,10,IF(C32=5,3,IF(C32=6,6,C32)))))))","v":12},{"$f":"IF(G32=0,2,IF(G32=1,4,IF(G32=2,5,IF(G32=3,8,IF(G32=4,10,IF(G32=5,3,IF(G32=6,6,G32)))))))","v":15},{"$f":"IF(I32=H32,I32+1,I32)","v":15},{"$f":"H32*J32","v":180},{"$f":"IF(H32=2,1,INT(((K32-1)*RAND())/(I32-1)))","v":6},{"$f":"IF(L32=H32,L32+1,L32)","v":6},{"$f":"IF(M32=0,1,M32)","v":6},{"$f":"N32*J32","v":90},{"$f":"RANDBETWEEN(1,(2*J32-1))","v":23},{"$f":"P32*H32","v":276},1,"-",{"$f":"IF(AND(R32=1,Q32>O32),P32,N32)","v":23},{"$f":"S32","v":"-"},{"$f":"IF(AND(R32=1,Q32>O32),N32,P32)","v":6},"=",{"$f":"Q32","v":276},0,{"$f":"O32","v":90},"=",{"$f":"IF(R32=0,O32+Q32,ABS(O32-Q32))","v":186},{"$f":"IF(AB32>=AB33,\"Improper\",\"Proper\")","v":"Improper"},null,{"$f":"GCD(AB32,AB33)","v":6},{"$f":"AB32/AE32","v":31},null,{"$f":"INT(AF32/AF33)","v":1},{"$f":"IF(AB32=AB33,\"\",AF32-AH32*AF33)","v":1},{"$f":"AH32","v":1},{"$f":"AI32","v":1},{"$f":"IF(AK32=AF32,\"\",AK32)","v":1},null,{"$f":"CONCATENATE(AB32,\"/\",AB33)","v":"186/180"},"=",{"$f":"CONCATENATE(AF32,\"/\",AF33)","v":"31/30"},"=",{"$f":"IF(AH32=0,CONCATENATE(AI32,\"/\",AF33),CONCATENATE(AH32,\" \",AI32,\"/\",AF33))","v":"1 1/30"}]
[null,null,null,null,null,null,null,null,null,null,null,null,null,null,null,null,null,1,"-",{"$f":"IF(AND(R32=1,Q32>O32),J32,H32)","v":15},null,{"$f":"IF(AND(R32=1,Q32>O32),H32,J32)","v":12},null,{"$f":"K32","v":180},0,{"$f":"K32","v":180},null,{"$f":"K32","v":180},null,null,null,{"$f":"AB33/AE32","v":30},{"$f":"IF(AF33=AF32,\"\",AF33)","v":30},null,null,null,{"$f":"AF33","v":30},{"$f":"IF(OR(AK32=AF32,AK32=0),\"\",AK33)","v":30}]
[16,{"$f":"CONCATENATE(A34,\")\")","v":"16)"},{"$f":"IF($R$1=1,INT(5*RAND()),IF($R$1=2,INT(7*RAND()),INT(16*RAND()+1)))","v":4},{"$f":"IF($R$1=1,INT(5*RAND()),IF($R$1=2,INT(7*RAND()),INT(16*RAND()+1)))","v":8},{"$f":"IF(D34=C34,IF($R$1=1,INT(5*RAND()),IF($R$1=2,INT(7*RAND()),INT(16*RAND()+1))),D34)","v":8},{"$f":"IF(E34=C34,IF($R$1=1,INT(5*RAND()),IF($R$1=2,INT(7*RAND()),INT(16*RAND()+1))),E34)","v":8},{"$f":"IF(F34=C34,IF($R$1=1,INT(5*RAND()),IF($R$1=2,INT(7*RAND()),INT(16*RAND()+1))),F34)","v":8},{"$f":"IF(C34=0,2,IF(C34=1,4,IF(C34=2,5,IF(C34=3,8,IF(C34=4,10,IF(C34=5,3,IF(C34=6,6,C34)))))))","v":10},{"$f":"IF(G34=0,2,IF(G34=1,4,IF(G34=2,5,IF(G34=3,8,IF(G34=4,10,IF(G34=5,3,IF(G34=6,6,G34)))))))","v":8},{"$f":"IF(I34=H34,I34+1,I34)","v":8},{"$f":"H34*J34","v":80},{"$f":"IF(H34=2,1,INT(((K34-1)*RAND())/(I34-1)))","v":5},{"$f":"IF(L34=H34,L34+1,L34)","v":5},{"$f":"IF(M34=0,1,M34)","v":5},{"$f":"N34*J34","v":40},{"$f":"RANDBETWEEN(1,(2*J34-1))","v":6},{"$f":"P34*H34","v":60},1,"-",{"$f":"IF(AND(R34=1,Q34>O34),P34,N34)","v":6},{"$f":"S34","v":"-"},{"$f":"IF(AND(R34=1,Q34>O34),N34,P34)","v":5},"=",{"$f":"Q34","v":60},0,{"$f":"O34","v":40},"=",{"$f":"IF(R34=0,O34+Q34,ABS(O34-Q34))","v":20},{"$f":"IF(AB34>=AB35,\"Improper\",\"Proper\")","v":"Proper"},null,{"$f":"GCD(AB34,AB35)","v":20},{"$f":"AB34/AE34","v":1},null,{"$f":"INT(AF34/AF35)","v":0},{"$f":"IF(AB34=AB35,\"\",AF34-AH34*AF35)","v":1},{"$f":"AH34","v":0},{"$f":"AI34","v":1},{"$f":"IF(AK34=AF34,\"\",AK34)","v":""},null,{"$f":"CONCATENATE(AB34,\"/\",AB35)","v":"20/80"},"=",{"$f":"CONCATENATE(AF34,\"/\",AF35)","v":"1/4"},"=",{"$f":"IF(AH34=0,CONCATENATE(AI34,\"/\",AF35),CONCATENATE(AH34,\" \",AI34,\"/\",AF35))","v":"1/4"}]
[null,null,null,null,null,null,null,null,null,null,null,null,null,null,null,null,null,1,"-",{"$f":"IF(AND(R34=1,Q34>O34),J34,H34)","v":8},null,{"$f":"IF(AND(R34=1,Q34>O34),H34,J34)","v":10},null,{"$f":"K34","v":80},0,{"$f":"K34","v":80},null,{"$f":"K34","v":80},null,null,null,{"$f":"AB35/AE34","v":4},{"$f":"IF(AF35=AF34,\"\",AF35)","v":4},null,null,null,{"$f":"AF35","v":4},{"$f":"IF(OR(AK34=AF34,AK34=0),\"\",AK35)","v":""}]
[17,{"$f":"CONCATENATE(A36,\")\")","v":"17)"},{"$f":"IF($R$1=1,INT(5*RAND()),IF($R$1=2,INT(7*RAND()),INT(16*RAND()+1)))","v":8},{"$f":"IF($R$1=1,INT(5*RAND()),IF($R$1=2,INT(7*RAND()),INT(16*RAND()+1)))","v":11},{"$f":"IF(D36=C36,IF($R$1=1,INT(5*RAND()),IF($R$1=2,INT(7*RAND()),INT(16*RAND()+1))),D36)","v":11},{"$f":"IF(E36=C36,IF($R$1=1,INT(5*RAND()),IF($R$1=2,INT(7*RAND()),INT(16*RAND()+1))),E36)","v":11},{"$f":"IF(F36=C36,IF($R$1=1,INT(5*RAND()),IF($R$1=2,INT(7*RAND()),INT(16*RAND()+1))),F36)","v":11},{"$f":"IF(C36=0,2,IF(C36=1,4,IF(C36=2,5,IF(C36=3,8,IF(C36=4,10,IF(C36=5,3,IF(C36=6,6,C36)))))))","v":8},{"$f":"IF(G36=0,2,IF(G36=1,4,IF(G36=2,5,IF(G36=3,8,IF(G36=4,10,IF(G36=5,3,IF(G36=6,6,G36)))))))","v":11},{"$f":"IF(I36=H36,I36+1,I36)","v":11},{"$f":"H36*J36","v":88},{"$f":"IF(H36=2,1,INT(((K36-1)*RAND())/(I36-1)))","v":8},{"$f":"IF(L36=H36,L36+1,L36)","v":9},{"$f":"IF(M36=0,1,M36)","v":9},{"$f":"N36*J36","v":99},{"$f":"RANDBETWEEN(1,(2*J36-1))","v":6},{"$f":"P36*H36","v":48},1,"-",{"$f":"IF(AND(R36=1,Q36>O36),P36,N36)","v":9},{"$f":"S36","v":"-"},{"$f":"IF(AND(R36=1,Q36>O36),N36,P36)","v":6},"=",{"$f":"Q36","v":48},0,{"$f":"O36","v":99},"=",{"$f":"IF(R36=0,O36+Q36,ABS(O36-Q36))","v":51},{"$f":"IF(AB36>=AB37,\"Improper\",\"Proper\")","v":"Proper"},null,{"$f":"GCD(AB36,AB37)","v":1},{"$f":"AB36/AE36","v":51},null,{"$f":"INT(AF36/AF37)","v":0},{"$f":"IF(AB36=AB37,\"\",AF36-AH36*AF37)","v":51},{"$f":"AH36","v":0},{"$f":"AI36","v":51},{"$f":"IF(AK36=AF36,\"\",AK36)","v":""},null,{"$f":"CONCATENATE(AB36,\"/\",AB37)","v":"51/88"},"=",{"$f":"CONCATENATE(AF36,\"/\",AF37)","v":"51/88"},"=",{"$f":"IF(AH36=0,CONCATENATE(AI36,\"/\",AF37),CONCATENATE(AH36,\" \",AI36,\"/\",AF37))","v":"51/88"}]
[null,null,null,null,null,null,null,null,null,null,null,null,null,null,null,null,null,1,"-",{"$f":"IF(AND(R36=1,Q36>O36),J36,H36)","v":8},null,{"$f":"IF(AND(R36=1,Q36>O36),H36,J36)","v":11},null,{"$f":"K36","v":88},0,{"$f":"K36","v":88},null,{"$f":"K36","v":88},null,null,null,{"$f":"AB37/AE36","v":88},{"$f":"IF(AF37=AF36,\"\",AF37)","v":88},null,null,null,{"$f":"AF37","v":88},{"$f":"IF(OR(AK36=AF36,AK36=0),\"\",AK37)","v":""}]
[18,{"$f":"CONCATENATE(A38,\")\")","v":"18)"},{"$f":"IF($R$1=1,INT(5*RAND()),IF($R$1=2,INT(7*RAND()),INT(16*RAND()+1)))","v":15},{"$f":"IF($R$1=1,INT(5*RAND()),IF($R$1=2,INT(7*RAND()),INT(16*RAND()+1)))","v":11},{"$f":"IF(D38=C38,IF($R$1=1,INT(5*RAND()),IF($R$1=2,INT(7*RAND()),INT(16*RAND()+1))),D38)","v":11},{"$f":"IF(E38=C38,IF($R$1=1,INT(5*RAND()),IF($R$1=2,INT(7*RAND()),INT(16*RAND()+1))),E38)","v":11},{"$f":"IF(F38=C38,IF($R$1=1,INT(5*RAND()),IF($R$1=2,INT(7*RAND()),INT(16*RAND()+1))),F38)","v":11},{"$f":"IF(C38=0,2,IF(C38=1,4,IF(C38=2,5,IF(C38=3,8,IF(C38=4,10,IF(C38=5,3,IF(C38=6,6,C38)))))))","v":15},{"$f":"IF(G38=0,2,IF(G38=1,4,IF(G38=2,5,IF(G38=3,8,IF(G38=4,10,IF(G38=5,3,IF(G38=6,6,G38)))))))","v":11},{"$f":"IF(I38=H38,I38+1,I38)","v":11},{"$f":"H38*J38","v":165},{"$f":"IF(H38=2,1,INT(((K38-1)*RAND())/(I38-1)))","v":10},{"$f":"IF(L38=H38,L38+1,L38)","v":10},{"$f":"IF(M38=0,1,M38)","v":10},{"$f":"N38*J38","v":110},{"$f":"RANDBETWEEN(1,(2*J38-1))","v":8},{"$f":"P38*H38","v":120},1,"-",{"$f":"IF(AND(R38=1,Q38>O38),P38,N38)","v":8},{"$f":"S38","v":"-"},{"$f":"IF(AND(R38=1,Q38>O38),N38,P38)","v":10},"=",{"$f":"Q38","v":120},0,{"$f":"O38","v":110},"=",{"$f":"IF(R38=0,O38+Q38,ABS(O38-Q38))","v":10},{"$f":"IF(AB38>=AB39,\"Improper\",\"Proper\")","v":"Proper"},null,{"$f":"GCD(AB38,AB39)","v":5},{"$f":"AB38/AE38","v":2},null,{"$f":"INT(AF38/AF39)","v":0},{"$f":"IF(AB38=AB39,\"\",AF38-AH38*AF39)","v":2},{"$f":"AH38","v":0},{"$f":"AI38","v":2},{"$f":"IF(AK38=AF38,\"\",AK38)","v":""},null,{"$f":"CONCATENATE(AB38,\"/\",AB39)","v":"10/165"},"=",{"$f":"CONCATENATE(AF38,\"/\",AF39)","v":"2/33"},"=",{"$f":"IF(AH38=0,CONCATENATE(AI38,\"/\",AF39),CONCATENATE(AH38,\" \",AI38,\"/\",AF39))","v":"2/33"}]
[null,null,null,null,null,null,null,null,null,null,null,null,null,null,null,null,null,1,"-",{"$f":"IF(AND(R38=1,Q38>O38),J38,H38)","v":11},null,{"$f":"IF(AND(R38=1,Q38>O38),H38,J38)","v":15},null,{"$f":"K38","v":165},0,{"$f":"K38","v":165},null,{"$f":"K38","v":165},null,null,null,{"$f":"AB39/AE38","v":33},{"$f":"IF(AF39=AF38,\"\",AF39)","v":33},null,null,null,{"$f":"AF39","v":33},{"$f":"IF(OR(AK38=AF38,AK38=0),\"\",AK39)","v":""}]
[19,{"$f":"CONCATENATE(A40,\")\")","v":"19)"},{"$f":"IF($R$1=1,INT(5*RAND()),IF($R$1=2,INT(7*RAND()),INT(16*RAND()+1)))","v":15},{"$f":"IF($R$1=1,INT(5*RAND()),IF($R$1=2,INT(7*RAND()),INT(16*RAND()+1)))","v":8},{"$f":"IF(D40=C40,IF($R$1=1,INT(5*RAND()),IF($R$1=2,INT(7*RAND()),INT(16*RAND()+1))),D40)","v":8},{"$f":"IF(E40=C40,IF($R$1=1,INT(5*RAND()),IF($R$1=2,INT(7*RAND()),INT(16*RAND()+1))),E40)","v":8},{"$f":"IF(F40=C40,IF($R$1=1,INT(5*RAND()),IF($R$1=2,INT(7*RAND()),INT(16*RAND()+1))),F40)","v":8},{"$f":"IF(C40=0,2,IF(C40=1,4,IF(C40=2,5,IF(C40=3,8,IF(C40=4,10,IF(C40=5,3,IF(C40=6,6,C40)))))))","v":15},{"$f":"IF(G40=0,2,IF(G40=1,4,IF(G40=2,5,IF(G40=3,8,IF(G40=4,10,IF(G40=5,3,IF(G40=6,6,G40)))))))","v":8},{"$f":"IF(I40=H40,I40+1,I40)","v":8},{"$f":"H40*J40","v":120},{"$f":"IF(H40=2,1,INT(((K40-1)*RAND())/(I40-1)))","v":14},{"$f":"IF(L40=H40,L40+1,L40)","v":14},{"$f":"IF(M40=0,1,M40)","v":14},{"$f":"N40*J40","v":112},{"$f":"RANDBETWEEN(1,(2*J40-1))","v":13},{"$f":"P40*H40","v":195},1,"-",{"$f":"IF(AND(R40=1,Q40>O40),P40,N40)","v":13},{"$f":"S40","v":"-"},{"$f":"IF(AND(R40=1,Q40>O40),N40,P40)","v":14},"=",{"$f":"Q40","v":195},0,{"$f":"O40","v":112},"=",{"$f":"IF(R40=0,O40+Q40,ABS(O40-Q40))","v":83},{"$f":"IF(AB40>=AB41,\"Improper\",\"Proper\")","v":"Proper"},null,{"$f":"GCD(AB40,AB41)","v":1},{"$f":"AB40/AE40","v":83},null,{"$f":"INT(AF40/AF41)","v":0},{"$f":"IF(AB40=AB41,\"\",AF40-AH40*AF41)","v":83},{"$f":"AH40","v":0},{"$f":"AI40","v":83},{"$f":"IF(AK40=AF40,\"\",AK40)","v":""},null,{"$f":"CONCATENATE(AB40,\"/\",AB41)","v":"83/120"},"=",{"$f":"CONCATENATE(AF40,\"/\",AF41)","v":"83/120"},"=",{"$f":"IF(AH40=0,CONCATENATE(AI40,\"/\",AF41),CONCATENATE(AH40,\" \",AI40,\"/\",AF41))","v":"83/120"}]
[null,null,null,null,null,null,null,null,null,null,null,null,null,null,null,null,null,1,"-",{"$f":"IF(AND(R40=1,Q40>O40),J40,H40)","v":8},null,{"$f":"IF(AND(R40=1,Q40>O40),H40,J40)","v":15},null,{"$f":"K40","v":120},0,{"$f":"K40","v":120},null,{"$f":"K40","v":120},null,null,null,{"$f":"AB41/AE40","v":120},{"$f":"IF(AF41=AF40,\"\",AF41)","v":120},null,null,null,{"$f":"AF41","v":120},{"$f":"IF(OR(AK40=AF40,AK40=0),\"\",AK41)","v":""}]
[20,{"$f":"CONCATENATE(A42,\")\")","v":"20)"},{"$f":"IF($R$1=1,INT(5*RAND()),IF($R$1=2,INT(7*RAND()),INT(16*RAND()+1)))","v":9},{"$f":"IF($R$1=1,INT(5*RAND()),IF($R$1=2,INT(7*RAND()),INT(16*RAND()+1)))","v":16},{"$f":"IF(D42=C42,IF($R$1=1,INT(5*RAND()),IF($R$1=2,INT(7*RAND()),INT(16*RAND()+1))),D42)","v":16},{"$f":"IF(E42=C42,IF($R$1=1,INT(5*RAND()),IF($R$1=2,INT(7*RAND()),INT(16*RAND()+1))),E42)","v":16},{"$f":"IF(F42=C42,IF($R$1=1,INT(5*RAND()),IF($R$1=2,INT(7*RAND()),INT(16*RAND()+1))),F42)","v":16},{"$f":"IF(C42=0,2,IF(C42=1,4,IF(C42=2,5,IF(C42=3,8,IF(C42=4,10,IF(C42=5,3,IF(C42=6,6,C42)))))))","v":9},{"$f":"IF(G42=0,2,IF(G42=1,4,IF(G42=2,5,IF(G42=3,8,IF(G42=4,10,IF(G42=5,3,IF(G42=6,6,G42)))))))","v":16},{"$f":"IF(I42=H42,I42+1,I42)","v":16},{"$f":"H42*J42","v":144},{"$f":"IF(H42=2,1,INT(((K42-1)*RAND())/(I42-1)))","v":3},{"$f":"IF(L42=H42,L42+1,L42)","v":3},{"$f":"IF(M42=0,1,M42)","v":3},{"$f":"N42*J42","v":48},{"$f":"RANDBETWEEN(1,(2*J42-1))","v":25},{"$f":"P42*H42","v":225},1,"-",{"$f":"IF(AND(R42=1,Q42>O42),P42,N42)","v":25},{"$f":"S42","v":"-"},{"$f":"IF(AND(R42=1,Q42>O42),N42,P42)","v":3},"=",{"$f":"Q42","v":225},0,{"$f":"O42","v":48},"=",{"$f":"IF(R42=0,O42+Q42,ABS(O42-Q42))","v":177},{"$f":"IF(AB42>=AB43,\"Improper\",\"Proper\")","v":"Improper"},null,{"$f":"GCD(AB42,AB43)","v":3},{"$f":"AB42/AE42","v":59},null,{"$f":"INT(AF42/AF43)","v":1},{"$f":"IF(AB42=AB43,\"\",AF42-AH42*AF43)","v":11},{"$f":"AH42","v":1},{"$f":"AI42","v":11},{"$f":"IF(AK42=AF42,\"\",AK42)","v":11},null,{"$f":"CONCATENATE(AB42,\"/\",AB43)","v":"177/144"},"=",{"$f":"CONCATENATE(AF42,\"/\",AF43)","v":"59/48"},"=",{"$f":"IF(AH42=0,CONCATENATE(AI42,\"/\",AF43),CONCATENATE(AH42,\" \",AI42,\"/\",AF43))","v":"1 11/48"}]
[null,null,null,null,null,null,null,null,null,null,null,null,null,null,null,null,null,1,"-",{"$f":"IF(AND(R42=1,Q42>O42),J42,H42)","v":16},null,{"$f":"IF(AND(R42=1,Q42>O42),H42,J42)","v":9},null,{"$f":"K42","v":144},0,{"$f":"K42","v":144},null,{"$f":"K42","v":144},null,null,null,{"$f":"AB43/AE42","v":48},{"$f":"IF(AF43=AF42,\"\",AF43)","v":48},null,null,null,{"$f":"AF43","v":48},{"$f":"IF(OR(AK42=AF42,AK42=0),\"\",AK43)","v":48}]
[21,{"$f":"CONCATENATE(A44,\")\")","v":"21)"},{"$f":"IF($R$1=1,INT(5*RAND()),IF($R$1=2,INT(7*RAND()),INT(16*RAND()+1)))","v":14},{"$f":"IF($R$1=1,INT(5*RAND()),IF($R$1=2,INT(7*RAND()),INT(16*RAND()+1)))","v":16},{"$f":"IF(D44=C44,IF($R$1=1,INT(5*RAND()),IF($R$1=2,INT(7*RAND()),INT(16*RAND()+1))),D44)","v":16},{"$f":"IF(E44=C44,IF($R$1=1,INT(5*RAND()),IF($R$1=2,INT(7*RAND()),INT(16*RAND()+1))),E44)","v":16},{"$f":"IF(F44=C44,IF($R$1=1,INT(5*RAND()),IF($R$1=2,INT(7*RAND()),INT(16*RAND()+1))),F44)","v":16},{"$f":"IF(C44=0,2,IF(C44=1,4,IF(C44=2,5,IF(C44=3,8,IF(C44=4,10,IF(C44=5,3,IF(C44=6,6,C44)))))))","v":14},{"$f":"IF(G44=0,2,IF(G44=1,4,IF(G44=2,5,IF(G44=3,8,IF(G44=4,10,IF(G44=5,3,IF(G44=6,6,G44)))))))","v":16},{"$f":"IF(I44=H44,I44+1,I44)","v":16},{"$f":"H44*J44","v":224},{"$f":"IF(H44=2,1,INT(((K44-1)*RAND())/(I44-1)))","v":4},{"$f":"IF(L44=H44,L44+1,L44)","v":4},{"$f":"IF(M44=0,1,M44)","v":4},{"$f":"N44*J44","v":64},{"$f":"RANDBETWEEN(1,(2*J44-1))","v":31},{"$f":"P44*H44","v":434},1,"-",{"$f":"IF(AND(R44=1,Q44>O44),P44,N44)","v":31},{"$f":"S44","v":"-"},{"$f":"IF(AND(R44=1,Q44>O44),N44,P44)","v":4},"=",{"$f":"Q44","v":434},0,{"$f":"O44","v":64},"=",{"$f":"IF(R44=0,O44+Q44,ABS(O44-Q44))","v":370},{"$f":"IF(AB44>=AB45,\"Improper\",\"Proper\")","v":"Improper"},null,{"$f":"GCD(AB44,AB45)","v":2},{"$f":"AB44/AE44","v":185},null,{"$f":"INT(AF44/AF45)","v":1},{"$f":"IF(AB44=AB45,\"\",AF44-AH44*AF45)","v":73},{"$f":"AH44","v":1},{"$f":"AI44","v":73},{"$f":"IF(AK44=AF44,\"\",AK44)","v":73},null,{"$f":"CONCATENATE(AB44,\"/\",AB45)","v":"370/224"},"=",{"$f":"CONCATENATE(AF44,\"/\",AF45)","v":"185/112"},"=",{"$f":"IF(AH44=0,CONCATENATE(AI44,\"/\",AF45),CONCATENATE(AH44,\" \",AI44,\"/\",AF45))","v":"1 73/112"}]
[null,null,null,null,null,null,null,null,null,null,null,null,null,null,null,null,null,1,"-",{"$f":"IF(AND(R44=1,Q44>O44),J44,H44)","v":16},null,{"$f":"IF(AND(R44=1,Q44>O44),H44,J44)","v":14},null,{"$f":"K44","v":224},0,{"$f":"K44","v":224},null,{"$f":"K44","v":224},null,null,null,{"$f":"AB45/AE44","v":112},{"$f":"IF(AF45=AF44,\"\",AF45)","v":112},null,null,null,{"$f":"AF45","v":112},{"$f":"IF(OR(AK44=AF44,AK44=0),\"\",AK45)","v":112}]
[22,{"$f":"CONCATENATE(A46,\")\")","v":"22)"},{"$f":"IF($R$1=1,INT(5*RAND()),IF($R$1=2,INT(7*RAND()),INT(16*RAND()+1)))","v":4},{"$f":"IF($R$1=1,INT(5*RAND()),IF($R$1=2,INT(7*RAND()),INT(16*RAND()+1)))","v":11},{"$f":"IF(D46=C46,IF($R$1=1,INT(5*RAND()),IF($R$1=2,INT(7*RAND()),INT(16*RAND()+1))),D46)","v":11},{"$f":"IF(E46=C46,IF($R$1=1,INT(5*RAND()),IF($R$1=2,INT(7*RAND()),INT(16*RAND()+1))),E46)","v":11},{"$f":"IF(F46=C46,IF($R$1=1,INT(5*RAND()),IF($R$1=2,INT(7*RAND()),INT(16*RAND()+1))),F46)","v":11},{"$f":"IF(C46=0,2,IF(C46=1,4,IF(C46=2,5,IF(C46=3,8,IF(C46=4,10,IF(C46=5,3,IF(C46=6,6,C46)))))))","v":10},{"$f":"IF(G46=0,2,IF(G46=1,4,IF(G46=2,5,IF(G46=3,8,IF(G46=4,10,IF(G46=5,3,IF(G46=6,6,G46)))))))","v":11},{"$f":"IF(I46=H46,I46+1,I46)","v":11},{"$f":"H46*J46","v":110},{"$f":"IF(H46=2,1,INT(((K46-1)*RAND())/(I46-1)))","v":0},{"$f":"IF(L46=H46,L46+1,L46)","v":0},{"$f":"IF(M46=0,1,M46)","v":1},{"$f":"N46*J46","v":11},{"$f":"RANDBETWEEN(1,(2*J46-1))","v":4},{"$f":"P46*H46","v":40},1,"-",{"$f":"IF(AND(R46=1,Q46>O46),P46,N46)","v":4},{"$f":"S46","v":"-"},{"$f":"IF(AND(R46=1,Q46>O46),N46,P46)","v":1},"=",{"$f":"Q46","v":40},0,{"$f":"O46","v":11},"=",{"$f":"IF(R46=0,O46+Q46,ABS(O46-Q46))","v":29},{"$f":"IF(AB46>=AB47,\"Improper\",\"Proper\")","v":"Proper"},null,{"$f":"GCD(AB46,AB47)","v":1},{"$f":"AB46/AE46","v":29},null,{"$f":"INT(AF46/AF47)","v":0},{"$f":"IF(AB46=AB47,\"\",AF46-AH46*AF47)","v":29},{"$f":"AH46","v":0},{"$f":"AI46","v":29},{"$f":"IF(AK46=AF46,\"\",AK46)","v":""},null,{"$f":"CONCATENATE(AB46,\"/\",AB47)","v":"29/110"},"=",{"$f":"CONCATENATE(AF46,\"/\",AF47)","v":"29/110"},"=",{"$f":"IF(AH46=0,CONCATENATE(AI46,\"/\",AF47),CONCATENATE(AH46,\" \",AI46,\"/\",AF47))","v":"29/110"}]
[null,null,null,null,null,null,null,null,null,null,null,null,null,null,null,null,null,1,"-",{"$f":"IF(AND(R46=1,Q46>O46),J46,H46)","v":11},null,{"$f":"IF(AND(R46=1,Q46>O46),H46,J46)","v":10},null,{"$f":"K46","v":110},0,{"$f":"K46","v":110},null,{"$f":"K46","v":110},null,null,null,{"$f":"AB47/AE46","v":110},{"$f":"IF(AF47=AF46,\"\",AF47)","v":110},null,null,null,{"$f":"AF47","v":110},{"$f":"IF(OR(AK46=AF46,AK46=0),\"\",AK47)","v":""}]
[23,{"$f":"CONCATENATE(A48,\")\")","v":"23)"},{"$f":"IF($R$1=1,INT(5*RAND()),IF($R$1=2,INT(7*RAND()),INT(16*RAND()+1)))","v":7},{"$f":"IF($R$1=1,INT(5*RAND()),IF($R$1=2,INT(7*RAND()),INT(16*RAND()+1)))","v":1},{"$f":"IF(D48=C48,IF($R$1=1,INT(5*RAND()),IF($R$1=2,INT(7*RAND()),INT(16*RAND()+1))),D48)","v":1},{"$f":"IF(E48=C48,IF($R$1=1,INT(5*RAND()),IF($R$1=2,INT(7*RAND()),INT(16*RAND()+1))),E48)","v":1},{"$f":"IF(F48=C48,IF($R$1=1,INT(5*RAND()),IF($R$1=2,INT(7*RAND()),INT(16*RAND()+1))),F48)","v":1},{"$f":"IF(C48=0,2,IF(C48=1,4,IF(C48=2,5,IF(C48=3,8,IF(C48=4,10,IF(C48=5,3,IF(C48=6,6,C48)))))))","v":7},{"$f":"IF(G48=0,2,IF(G48=1,4,IF(G48=2,5,IF(G48=3,8,IF(G48=4,10,IF(G48=5,3,IF(G48=6,6,G48)))))))","v":4},{"$f":"IF(I48=H48,I48+1,I48)","v":4},{"$f":"H48*J48","v":28},{"$f":"IF(H48=2,1,INT(((K48-1)*RAND())/(I48-1)))","v":6},{"$f":"IF(L48=H48,L48+1,L48)","v":6},{"$f":"IF(M48=0,1,M48)","v":6},{"$f":"N48*J48","v":24},{"$f":"RANDBETWEEN(1,(2*J48-1))","v":3},{"$f":"P48*H48","v":21},1,"-",{"$f":"IF(AND(R48=1,Q48>O48),P48,N48)","v":6},{"$f":"S48","v":"-"},{"$f":"IF(AND(R48=1,Q48>O48),N48,P48)","v":3},"=",{"$f":"Q48","v":21},0,{"$f":"O48","v":24},"=",{"$f":"IF(R48=0,O48+Q48,ABS(O48-Q48))","v":3},{"$f":"IF(AB48>=AB49,\"Improper\",\"Proper\")","v":"Proper"},null,{"$f":"GCD(AB48,AB49)","v":1},{"$f":"AB48/AE48","v":3},null,{"$f":"INT(AF48/AF49)","v":0},{"$f":"IF(AB48=AB49,\"\",AF48-AH48*AF49)","v":3},{"$f":"AH48","v":0},{"$f":"AI48","v":3},{"$f":"IF(AK48=AF48,\"\",AK48)","v":""},null,{"$f":"CONCATENATE(AB48,\"/\",AB49)","v":"3/28"},"=",{"$f":"CONCATENATE(AF48,\"/\",AF49)","v":"3/28"},"=",{"$f":"IF(AH48=0,CONCATENATE(AI48,\"/\",AF49),CONCATENATE(AH48,\" \",AI48,\"/\",AF49))","v":"3/28"}]
[null,null,null,null,null,null,null,null,null,null,null,null,null,null,null,null,null,1,"-",{"$f":"IF(AND(R48=1,Q48>O48),J48,H48)","v":7},null,{"$f":"IF(AND(R48=1,Q48>O48),H48,J48)","v":4},null,{"$f":"K48","v":28},0,{"$f":"K48","v":28},null,{"$f":"K48","v":28},null,null,null,{"$f":"AB49/AE48","v":28},{"$f":"IF(AF49=AF48,\"\",AF49)","v":28},null,null,null,{"$f":"AF49","v":28},{"$f":"IF(OR(AK48=AF48,AK48=0),\"\",AK49)","v":""}]
[24,{"$f":"CONCATENATE(A50,\")\")","v":"24)"},{"$f":"IF($R$1=1,INT(5*RAND()),IF($R$1=2,INT(7*RAND()),INT(16*RAND()+1)))","v":12},{"$f":"IF($R$1=1,INT(5*RAND()),IF($R$1=2,INT(7*RAND()),INT(16*RAND()+1)))","v":9},{"$f":"IF(D50=C50,IF($R$1=1,INT(5*RAND()),IF($R$1=2,INT(7*RAND()),INT(16*RAND()+1))),D50)","v":9},{"$f":"IF(E50=C50,IF($R$1=1,INT(5*RAND()),IF($R$1=2,INT(7*RAND()),INT(16*RAND()+1))),E50)","v":9},{"$f":"IF(F50=C50,IF($R$1=1,INT(5*RAND()),IF($R$1=2,INT(7*RAND()),INT(16*RAND()+1))),F50)","v":9},{"$f":"IF(C50=0,2,IF(C50=1,4,IF(C50=2,5,IF(C50=3,8,IF(C50=4,10,IF(C50=5,3,IF(C50=6,6,C50)))))))","v":12},{"$f":"IF(G50=0,2,IF(G50=1,4,IF(G50=2,5,IF(G50=3,8,IF(G50=4,10,IF(G50=5,3,IF(G50=6,6,G50)))))))","v":9},{"$f":"IF(I50=H50,I50+1,I50)","v":9},{"$f":"H50*J50","v":108},{"$f":"IF(H50=2,1,INT(((K50-1)*RAND())/(I50-1)))","v":12},{"$f":"IF(L50=H50,L50+1,L50)","v":13},{"$f":"IF(M50=0,1,M50)","v":13},{"$f":"N50*J50","v":117},{"$f":"RANDBETWEEN(1,(2*J50-1))","v":11},{"$f":"P50*H50","v":132},1,"-",{"$f":"IF(AND(R50=1,Q50>O50),P50,N50)","v":11},{"$f":"S50","v":"-"},{"$f":"IF(AND(R50=1,Q50>O50),N50,P50)","v":13},"=",{"$f":"Q50","v":132},0,{"$f":"O50","v":117},"=",{"$f":"IF(R50=0,O50+Q50,ABS(O50-Q50))","v":15},{"$f":"IF(AB50>=AB51,\"Improper\",\"Proper\")","v":"Proper"},null,{"$f":"GCD(AB50,AB51)","v":3},{"$f":"AB50/AE50","v":5},null,{"$f":"INT(AF50/AF51)","v":0},{"$f":"IF(AB50=AB51,\"\",AF50-AH50*AF51)","v":5},{"$f":"AH50","v":0},{"$f":"AI50","v":5},{"$f":"IF(AK50=AF50,\"\",AK50)","v":""},null,{"$f":"CONCATENATE(AB50,\"/\",AB51)","v":"15/108"},"=",{"$f":"CONCATENATE(AF50,\"/\",AF51)","v":"5/36"},"=",{"$f":"IF(AH50=0,CONCATENATE(AI50,\"/\",AF51),CONCATENATE(AH50,\" \",AI50,\"/\",AF51))","v":"5/36"}]
[null,null,null,null,null,null,null,null,null,null,null,null,null,null,null,null,null,1,"-",{"$f":"IF(AND(R50=1,Q50>O50),J50,H50)","v":9},null,{"$f":"IF(AND(R50=1,Q50>O50),H50,J50)","v":12},null,{"$f":"K50","v":108},0,{"$f":"K50","v":108},null,{"$f":"K50","v":108},null,null,null,{"$f":"AB51/AE50","v":36},{"$f":"IF(AF51=AF50,\"\",AF51)","v":36},null,null,null,{"$f":"AF51","v":36},{"$f":"IF(OR(AK50=AF50,AK50=0),\"\",AK51)","v":""}]
[25,{"$f":"CONCATENATE(A52,\")\")","v":"25)"},{"$f":"IF($R$1=1,INT(5*RAND()),IF($R$1=2,INT(7*RAND()),INT(16*RAND()+1)))","v":13},{"$f":"IF($R$1=1,INT(5*RAND()),IF($R$1=2,INT(7*RAND()),INT(16*RAND()+1)))","v":8},{"$f":"IF(D52=C52,IF($R$1=1,INT(5*RAND()),IF($R$1=2,INT(7*RAND()),INT(16*RAND()+1))),D52)","v":8},{"$f":"IF(E52=C52,IF($R$1=1,INT(5*RAND()),IF($R$1=2,INT(7*RAND()),INT(16*RAND()+1))),E52)","v":8},{"$f":"IF(F52=C52,IF($R$1=1,INT(5*RAND()),IF($R$1=2,INT(7*RAND()),INT(16*RAND()+1))),F52)","v":8},{"$f":"IF(C52=0,2,IF(C52=1,4,IF(C52=2,5,IF(C52=3,8,IF(C52=4,10,IF(C52=5,3,IF(C52=6,6,C52)))))))","v":13},{"$f":"IF(G52=0,2,IF(G52=1,4,IF(G52=2,5,IF(G52=3,8,IF(G52=4,10,IF(G52=5,3,IF(G52=6,6,G52)))))))","v":8},{"$f":"IF(I52=H52,I52+1,I52)","v":8},{"$f":"H52*J52","v":104},{"$f":"IF(H52=2,1,INT(((K52-1)*RAND())/(I52-1)))","v":0},{"$f":"IF(L52=H52,L52+1,L52)","v":0},{"$f":"IF(M52=0,1,M52)","v":1},{"$f":"N52*J52","v":8},{"$f":"RANDBETWEEN(1,(2*J52-1))","v":8},{"$f":"P52*H52","v":104},1,"-",{"$f":"IF(AND(R52=1,Q52>O52),P52,N52)","v":8},{"$f":"S52","v":"-"},{"$f":"IF(AND(R52=1,Q52>O52),N52,P52)","v":1},"=",{"$f":"Q52","v":104},0,{"$f":"O52","v":8},"=",{"$f":"IF(R52=0,O52+Q52,ABS(O52-Q52))","v":96},{"$f":"IF(AB52>=AB53,\"Improper\",\"Proper\")","v":"Proper"},null,{"$f":"GCD(AB52,AB53)","v":8},{"$f":"AB52/AE52","v":12},null,{"$f":"INT(AF52/AF53)","v":0},{"$f":"IF(AB52=AB53,\"\",AF52-AH52*AF53)","v":12},{"$f":"AH52","v":0},{"$f":"AI52","v":12},{"$f":"IF(AK52=AF52,\"\",AK52)","v":""},null,{"$f":"CONCATENATE(AB52,\"/\",AB53)","v":"96/104"},"=",{"$f":"CONCATENATE(AF52,\"/\",AF53)","v":"12/13"},"=",{"$f":"IF(AH52=0,CONCATENATE(AI52,\"/\",AF53),CONCATENATE(AH52,\" \",AI52,\"/\",AF53))","v":"12/13"}]
[null,null,null,null,null,null,null,null,null,null,null,null,null,null,null,null,null,1,"-",{"$f":"IF(AND(R52=1,Q52>O52),J52,H52)","v":8},null,{"$f":"IF(AND(R52=1,Q52>O52),H52,J52)","v":13},null,{"$f":"K52","v":104},0,{"$f":"K52","v":104},null,{"$f":"K52","v":104},null,null,null,{"$f":"AB53/AE52","v":13},{"$f":"IF(AF53=AF52,\"\",AF53)","v":13},null,null,null,{"$f":"AF53","v":13},{"$f":"IF(OR(AK52=AF52,AK52=0),\"\",AK53)","v":""}]
[26,{"$f":"CONCATENATE(A54,\")\")","v":"26)"},{"$f":"IF($R$1=1,INT(5*RAND()),IF($R$1=2,INT(7*RAND()),INT(16*RAND()+1)))","v":2},{"$f":"IF($R$1=1,INT(5*RAND()),IF($R$1=2,INT(7*RAND()),INT(16*RAND()+1)))","v":5},{"$f":"IF(D54=C54,IF($R$1=1,INT(5*RAND()),IF($R$1=2,INT(7*RAND()),INT(16*RAND()+1))),D54)","v":5},{"$f":"IF(E54=C54,IF($R$1=1,INT(5*RAND()),IF($R$1=2,INT(7*RAND()),INT(16*RAND()+1))),E54)","v":5},{"$f":"IF(F54=C54,IF($R$1=1,INT(5*RAND()),IF($R$1=2,INT(7*RAND()),INT(16*RAND()+1))),F54)","v":5},{"$f":"IF(C54=0,2,IF(C54=1,4,IF(C54=2,5,IF(C54=3,8,IF(C54=4,10,IF(C54=5,3,IF(C54=6,6,C54)))))))","v":5},{"$f":"IF(G54=0,2,IF(G54=1,4,IF(G54=2,5,IF(G54=3,8,IF(G54=4,10,IF(G54=5,3,IF(G54=6,6,G54)))))))","v":3},{"$f":"IF(I54=H54,I54+1,I54)","v":3},{"$f":"H54*J54","v":15},{"$f":"IF(H54=2,1,INT(((K54-1)*RAND())/(I54-1)))","v":5},{"$f":"IF(L54=H54,L54+1,L54)","v":6},{"$f":"IF(M54=0,1,M54)","v":6},{"$f":"N54*J54","v":18},{"$f":"RANDBETWEEN(1,(2*J54-1))","v":5},{"$f":"P54*H54","v":25},1,"-",{"$f":"IF(AND(R54=1,Q54>O54),P54,N54)","v":5},{"$f":"S54","v":"-"},{"$f":"IF(AND(R54=1,Q54>O54),N54,P54)","v":6},"=",{"$f":"Q54","v":25},0,{"$f":"O54","v":18},"=",{"$f":"IF(R54=0,O54+Q54,ABS(O54-Q54))","v":7},{"$f":"IF(AB54>=AB55,\"Improper\",\"Proper\")","v":"Proper"},null,{"$f":"GCD(AB54,AB55)","v":1},{"$f":"AB54/AE54","v":7},null,{"$f":"INT(AF54/AF55)","v":0},{"$f":"IF(AB54=AB55,\"\",AF54-AH54*AF55)","v":7},{"$f":"AH54","v":0},{"$f":"AI54","v":7},{"$f":"IF(AK54=AF54,\"\",AK54)","v":""},null,{"$f":"CONCATENATE(AB54,\"/\",AB55)","v":"7/15"},"=",{"$f":"CONCATENATE(AF54,\"/\",AF55)","v":"7/15"},"=",{"$f":"IF(AH54=0,CONCATENATE(AI54,\"/\",AF55),CONCATENATE(AH54,\" \",AI54,\"/\",AF55))","v":"7/15"}]
[null,null,null,null,null,null,null,null,null,null,null,null,null,null,null,null,null,1,"-",{"$f":"IF(AND(R54=1,Q54>O54),J54,H54)","v":3},null,{"$f":"IF(AND(R54=1,Q54>O54),H54,J54)","v":5},null,{"$f":"K54","v":15},0,{"$f":"K54","v":15},null,{"$f":"K54","v":15},null,null,null,{"$f":"AB55/AE54","v":15},{"$f":"IF(AF55=AF54,\"\",AF55)","v":15},null,null,null,{"$f":"AF55","v":15},{"$f":"IF(OR(AK54=AF54,AK54=0),\"\",AK55)","v":""}]
[27,{"$f":"CONCATENATE(A56,\")\")","v":"27)"},{"$f":"IF($R$1=1,INT(5*RAND()),IF($R$1=2,INT(7*RAND()),INT(16*RAND()+1)))","v":16},{"$f":"IF($R$1=1,INT(5*RAND()),IF($R$1=2,INT(7*RAND()),INT(16*RAND()+1)))","v":2},{"$f":"IF(D56=C56,IF($R$1=1,INT(5*RAND()),IF($R$1=2,INT(7*RAND()),INT(16*RAND()+1))),D56)","v":2},{"$f":"IF(E56=C56,IF($R$1=1,INT(5*RAND()),IF($R$1=2,INT(7*RAND()),INT(16*RAND()+1))),E56)","v":2},{"$f":"IF(F56=C56,IF($R$1=1,INT(5*RAND()),IF($R$1=2,INT(7*RAND()),INT(16*RAND()+1))),F56)","v":2},{"$f":"IF(C56=0,2,IF(C56=1,4,IF(C56=2,5,IF(C56=3,8,IF(C56=4,10,IF(C56=5,3,IF(C56=6,6,C56)))))))","v":16},{"$f":"IF(G56=0,2,IF(G56=1,4,IF(G56=2,5,IF(G56=3,8,IF(G56=4,10,IF(G56=5,3,IF(G56=6,6,G56)))))))","v":5},{"$f":"IF(I56=H56,I56+1,I56)","v":5},{"$f":"H56*J56","v":80},{"$f":"IF(H56=2,1,INT(((K56-1)*RAND())/(I56-1)))","v":6},{"$f":"IF(L56=H56,L56+1,L56)","v":6},{"$f":"IF(M56=0,1,M56)","v":6},{"$f":"N56*J56","v":30},{"$f":"RANDBETWEEN(1,(2*J56-1))","v":3},{"$f":"P56*H56","v":48},1,"-",{"$f":"IF(AND(R56=1,Q56>O56),P56,N56)","v":3},{"$f":"S56","v":"-"},{"$f":"IF(AND(R56=1,Q56>O56),N56,P56)","v":6},"=",{"$f":"Q56","v":48},0,{"$f":"O56","v":30},"=",{"$f":"IF(R56=0,O56+Q56,ABS(O56-Q56))","v":18},{"$f":"IF(AB56>=AB57,\"Improper\",\"Proper\")","v":"Proper"},null,{"$f":"GCD(AB56,AB57)","v":2},{"$f":"AB56/AE56","v":9},null,{"$f":"INT(AF56/AF57)","v":0},{"$f":"IF(AB56=AB57,\"\",AF56-AH56*AF57)","v":9},{"$f":"AH56","v":0},{"$f":"AI56","v":9},{"$f":"IF(AK56=AF56,\"\",AK56)","v":""},null,{"$f":"CONCATENATE(AB56,\"/\",AB57)","v":"18/80"},"=",{"$f":"CONCATENATE(AF56,\"/\",AF57)","v":"9/40"},"=",{"$f":"IF(AH56=0,CONCATENATE(AI56,\"/\",AF57),CONCATENATE(AH56,\" \",AI56,\"/\",AF57))","v":"9/40"}]
[null,null,null,null,null,null,null,null,null,null,null,null,null,null,null,null,null,1,"-",{"$f":"IF(AND(R56=1,Q56>O56),J56,H56)","v":5},null,{"$f":"IF(AND(R56=1,Q56>O56),H56,J56)","v":16},null,{"$f":"K56","v":80},0,{"$f":"K56","v":80},null,{"$f":"K56","v":80},null,null,null,{"$f":"AB57/AE56","v":40},{"$f":"IF(AF57=AF56,\"\",AF57)","v":40},null,null,null,{"$f":"AF57","v":40},{"$f":"IF(OR(AK56=AF56,AK56=0),\"\",AK57)","v":""}]
[28,{"$f":"CONCATENATE(A58,\")\")","v":"28)"},{"$f":"IF($R$1=1,INT(5*RAND()),IF($R$1=2,INT(7*RAND()),INT(16*RAND()+1)))","v":15},{"$f":"IF($R$1=1,INT(5*RAND()),IF($R$1=2,INT(7*RAND()),INT(16*RAND()+1)))","v":14},{"$f":"IF(D58=C58,IF($R$1=1,INT(5*RAND()),IF($R$1=2,INT(7*RAND()),INT(16*RAND()+1))),D58)","v":14},{"$f":"IF(E58=C58,IF($R$1=1,INT(5*RAND()),IF($R$1=2,INT(7*RAND()),INT(16*RAND()+1))),E58)","v":14},{"$f":"IF(F58=C58,IF($R$1=1,INT(5*RAND()),IF($R$1=2,INT(7*RAND()),INT(16*RAND()+1))),F58)","v":14},{"$f":"IF(C58=0,2,IF(C58=1,4,IF(C58=2,5,IF(C58=3,8,IF(C58=4,10,IF(C58=5,3,IF(C58=6,6,C58)))))))","v":15},{"$f":"IF(G58=0,2,IF(G58=1,4,IF(G58=2,5,IF(G58=3,8,IF(G58=4,10,IF(G58=5,3,IF(G58=6,6,G58)))))))","v":14},{"$f":"IF(I58=H58,I58+1,I58)","v":14},{"$f":"H58*J58","v":210},{"$f":"IF(H58=2,1,INT(((K58-1)*RAND())/(I58-1)))","v":13},{"$f":"IF(L58=H58,L58+1,L58)","v":13},{"$f":"IF(M58=0,1,M58)","v":13},{"$f":"N58*J58","v":182},{"$f":"RANDBETWEEN(1,(2*J58-1))","v":20},{"$f":"P58*H58","v":300},1,"-",{"$f":"IF(AND(R58=1,Q58>O58),P58,N58)","v":20},{"$f":"S58","v":"-"},{"$f":"IF(AND(R58=1,Q58>O58),N58,P58)","v":13},"=",{"$f":"Q58","v":300},0,{"$f":"O58","v":182},"=",{"$f":"IF(R58=0,O58+Q58,ABS(O58-Q58))","v":118},{"$f":"IF(AB58>=AB59,\"Improper\",\"Proper\")","v":"Proper"},null,{"$f":"GCD(AB58,AB59)","v":2},{"$f":"AB58/AE58","v":59},null,{"$f":"INT(AF58/AF59)","v":0},{"$f":"IF(AB58=AB59,\"\",AF58-AH58*AF59)","v":59},{"$f":"AH58","v":0},{"$f":"AI58","v":59},{"$f":"IF(AK58=AF58,\"\",AK58)","v":""},null,{"$f":"CONCATENATE(AB58,\"/\",AB59)","v":"118/210"},"=",{"$f":"CONCATENATE(AF58,\"/\",AF59)","v":"59/105"},"=",{"$f":"IF(AH58=0,CONCATENATE(AI58,\"/\",AF59),CONCATENATE(AH58,\" \",AI58,\"/\",AF59))","v":"59/105"}]
[null,null,null,null,null,null,null,null,null,null,null,null,null,null,null,null,null,1,"-",{"$f":"IF(AND(R58=1,Q58>O58),J58,H58)","v":14},null,{"$f":"IF(AND(R58=1,Q58>O58),H58,J58)","v":15},null,{"$f":"K58","v":210},0,{"$f":"K58","v":210},null,{"$f":"K58","v":210},null,null,null,{"$f":"AB59/AE58","v":105},{"$f":"IF(AF59=AF58,\"\",AF59)","v":105},null,null,null,{"$f":"AF59","v":105},{"$f":"IF(OR(AK58=AF58,AK58=0),\"\",AK59)","v":""}]
[29,{"$f":"CONCATENATE(A60,\")\")","v":"29)"},{"$f":"IF($R$1=1,INT(5*RAND()),IF($R$1=2,INT(7*RAND()),INT(16*RAND()+1)))","v":12},{"$f":"IF($R$1=1,INT(5*RAND()),IF($R$1=2,INT(7*RAND()),INT(16*RAND()+1)))","v":5},{"$f":"IF(D60=C60,IF($R$1=1,INT(5*RAND()),IF($R$1=2,INT(7*RAND()),INT(16*RAND()+1))),D60)","v":5},{"$f":"IF(E60=C60,IF($R$1=1,INT(5*RAND()),IF($R$1=2,INT(7*RAND()),INT(16*RAND()+1))),E60)","v":5},{"$f":"IF(F60=C60,IF($R$1=1,INT(5*RAND()),IF($R$1=2,INT(7*RAND()),INT(16*RAND()+1))),F60)","v":5},{"$f":"IF(C60=0,2,IF(C60=1,4,IF(C60=2,5,IF(C60=3,8,IF(C60=4,10,IF(C60=5,3,IF(C60=6,6,C60)))))))","v":12},{"$f":"IF(G60=0,2,IF(G60=1,4,IF(G60=2,5,IF(G60=3,8,IF(G60=4,10,IF(G60=5,3,IF(G60=6,6,G60)))))))","v":3},{"$f":"IF(I60=H60,I60+1,I60)","v":3},{"$f":"H60*J60","v":36},{"$f":"IF(H60=2,1,INT(((K60-1)*RAND())/(I60-1)))","v":14},{"$f":"IF(L60=H60,L60+1,L60)","v":14},{"$f":"IF(M60=0,1,M60)","v":14},{"$f":"N60*J60","v":42},{"$f":"RANDBETWEEN(1,(2*J60-1))","v":4},{"$f":"P60*H60","v":48},1,"-",{"$f":"IF(AND(R60=1,Q60>O60),P60,N60)","v":4},{"$f":"S60","v":"-"},{"$f":"IF(AND(R60=1,Q60>O60),N60,P60)","v":14},"=",{"$f":"Q60","v":48},0,{"$f":"O60","v":42},"=",{"$f":"IF(R60=0,O60+Q60,ABS(O60-Q60))","v":6},{"$f":"IF(AB60>=AB61,\"Improper\",\"Proper\")","v":"Proper"},null,{"$f":"GCD(AB60,AB61)","v":6},{"$f":"AB60/AE60","v":1},null,{"$f":"INT(AF60/AF61)","v":0},{"$f":"IF(AB60=AB61,\"\",AF60-AH60*AF61)","v":1},{"$f":"AH60","v":0},{"$f":"AI60","v":1},{"$f":"IF(AK60=AF60,\"\",AK60)","v":""},null,{"$f":"CONCATENATE(AB60,\"/\",AB61)","v":"6/36"},"=",{"$f":"CONCATENATE(AF60,\"/\",AF61)","v":"1/6"},"=",{"$f":"IF(AH60=0,CONCATENATE(AI60,\"/\",AF61),CONCATENATE(AH60,\" \",AI60,\"/\",AF61))","v":"1/6"}]
[null,null,null,null,null,null,null,null,null,null,null,null,null,null,null,null,null,1,"-",{"$f":"IF(AND(R60=1,Q60>O60),J60,H60)","v":3},null,{"$f":"IF(AND(R60=1,Q60>O60),H60,J60)","v":12},null,{"$f":"K60","v":36},0,{"$f":"K60","v":36},null,{"$f":"K60","v":36},null,null,null,{"$f":"AB61/AE60","v":6},{"$f":"IF(AF61=AF60,\"\",AF61)","v":6},null,null,null,{"$f":"AF61","v":6},{"$f":"IF(OR(AK60=AF60,AK60=0),\"\",AK61)","v":""}]
[30,{"$f":"CONCATENATE(A62,\")\")","v":"30)"},{"$f":"IF($R$1=1,INT(5*RAND()),IF($R$1=2,INT(7*RAND()),INT(16*RAND()+1)))","v":10},{"$f":"IF($R$1=1,INT(5*RAND()),IF($R$1=2,INT(7*RAND()),INT(16*RAND()+1)))","v":7},{"$f":"IF(D62=C62,IF($R$1=1,INT(5*RAND()),IF($R$1=2,INT(7*RAND()),INT(16*RAND()+1))),D62)","v":7},{"$f":"IF(E62=C62,IF($R$1=1,INT(5*RAND()),IF($R$1=2,INT(7*RAND()),INT(16*RAND()+1))),E62)","v":7},{"$f":"IF(F62=C62,IF($R$1=1,INT(5*RAND()),IF($R$1=2,INT(7*RAND()),INT(16*RAND()+1))),F62)","v":7},{"$f":"IF(C62=0,2,IF(C62=1,4,IF(C62=2,5,IF(C62=3,8,IF(C62=4,10,IF(C62=5,3,IF(C62=6,6,C62)))))))","v":10},{"$f":"IF(G62=0,2,IF(G62=1,4,IF(G62=2,5,IF(G62=3,8,IF(G62=4,10,IF(G62=5,3,IF(G62=6,6,G62)))))))","v":7},{"$f":"IF(I62=H62,I62+1,I62)","v":7},{"$f":"H62*J62","v":70},{"$f":"IF(H62=2,1,INT(((K62-1)*RAND())/(I62-1)))","v":6},{"$f":"IF(L62=H62,L62+1,L62)","v":6},{"$f":"IF(M62=0,1,M62)","v":6},{"$f":"N62*J62","v":42},{"$f":"RANDBETWEEN(1,(2*J62-1))","v":1},{"$f":"P62*H62","v":10},1,"-",{"$f":"IF(AND(R62=1,Q62>O62),P62,N62)","v":6},{"$f":"S62","v":"-"},{"$f":"IF(AND(R62=1,Q62>O62),N62,P62)","v":1},"=",{"$f":"Q62","v":10},0,{"$f":"O62","v":42},"=",{"$f":"IF(R62=0,O62+Q62,ABS(O62-Q62))","v":32},{"$f":"IF(AB62>=AB63,\"Improper\",\"Proper\")","v":"Proper"},null,{"$f":"GCD(AB62,AB63)","v":2},{"$f":"AB62/AE62","v":16},null,{"$f":"INT(AF62/AF63)","v":0},{"$f":"IF(AB62=AB63,\"\",AF62-AH62*AF63)","v":16},{"$f":"AH62","v":0},{"$f":"AI62","v":16},{"$f":"IF(AK62=AF62,\"\",AK62)","v":""},null,{"$f":"CONCATENATE(AB62,\"/\",AB63)","v":"32/70"},"=",{"$f":"CONCATENATE(AF62,\"/\",AF63)","v":"16/35"},"=",{"$f":"IF(AH62=0,CONCATENATE(AI62,\"/\",AF63),CONCATENATE(AH62,\" \",AI62,\"/\",AF63))","v":"16/35"}]
[null,null,null,null,null,null,null,null,null,null,null,null,null,null,null,null,null,null,null,{"$f":"IF(AND(R62=1,Q62>O62),J62,H62)","v":10},null,{"$f":"IF(AND(R62=1,Q62>O62),H62,J62)","v":7},null,{"$f":"K62","v":70},null,{"$f":"K62","v":70},null,{"$f":"K62","v":70},null,null,null,{"$f":"AB63/AE62","v":35},{"$f":"IF(AF63=AF62,\"\",AF63)","v":35},null,null,null,{"$f":"AF63","v":35},{"$f":"IF(OR(AK62=AF62,AK62=0),\"\",AK63)","v":""}]