{"text_format":"1","workbook":"xlsx","n_sheets":4,"sheets":["Select","Working","Worksheet","Answers"],"not_rendered":{"charts":0,"images":4,"macros":1,"external_links":0,"defined_names":0,"comments":0,"pivot_tables":0},"unopened":[],"bounds":{"document_bytes":16777216,"sheet_cells":100000,"rows_first":2000,"rows_last":500,"rows_between":2000,"halvings":0,"cell_chars":16384,"cell_head_chars":4096},"cells_cut":0,"cells_raw":0,"read":"whole","date_system":"1900"}

{"sheet":"Select","index":0,"n_rows":11,"n_cols":8,"rows_kept":11,"cut":false,"hidden":false,"merged":[[0,1,0,7],[10,2,13,7],[5,7,8,8],[9,2,9,6],[1,2,1,6],[3,2,3,7],[5,2,5,4]]}
[null,"BINOMIAL EXPANSIONS"]
[null,null,"INSTRUCTIONS"]
[]
[null,"Step 1","Select desired type of binomial expansion"]
[]
[null,null,null,null,null,null,null,"PRESS F9 for NEW WorkSheet"]
[]
[]
[]
[null,"Step 2","Click on WorkSheet tab below."]
[null,"Note","If you click on the WorkSheet tab then hold down shift and click on the Solutions tab, you will be able to print both the WorkSheet and the solutions."]

{"sheet":"Working","index":1,"n_rows":77,"n_cols":66,"rows_kept":77,"cut":false,"hidden":true,"merged":[]}
[null,{"$f":"INT(900*RAND()+100)","v":568},{"$f":"TEXT(1,B1)","v":"568"},"QT-",null,null,"aX(bY+cZ)",null,"(bY+cZ)(AY+dZ)",null,"\"=b^2Y\"^2=2*b*c*YZ+c^2Z^2",null,null,null,null,null,null,null,null,null,null,null,null,{"$f":"IF(U1=1,\"\",TEXT(U1,U1))","v":""},null,null,null,null,null,null,null,null,null,null,null,null,null,null,null,null,null,null,null,null,null,null,null,null,null,null,null,null,null,null,null,"Binomial Expansions - 1",null,null,"Perfect squares - 2",null,null,"Difference of 2 squares - 3"]
[null,null,"Y",null,null,"Z",null,null,null,"a",null,null,null,"b",null,null,null,null,null,null,null,null,null,"c",null,null,null,"d",null,null,null,null,null,null,null,null,null,null,"d",null,"b^2",null,"c^2",null,"bd+ac",null,"Sign","cd",null,"Sign","Sign c2",null,"Questions","Random Question",null,"Expansion","Factorisation"]
[1,{"$f":"INT(24*RAND()+97)","v":100},{"$f":"IF(B3=108,CHAR(B3+1),CHAR(B3))","v":"d"},{"$f":"INT(24*RAND()+97)","v":104},{"$f":"IF(D3=B3, D3+1,IF(D3=C3,D3+1,D3))","v":104},{"$f":"IF(E3=108,CHAR(E3+1),CHAR(E3))","v":"h"},1,0,{"$f":"IF(H3=0,\"\",\"-\")","v":""},{"$f":"IF(G3=1,\"\",TEXT(G3,G3))","v":""},1,0,{"$f":"IF(L3=0,\"\",\"-\")","v":""},{"$f":"IF(K3=1,\"\",TEXT(K3,K3))","v":""},{"$f":"INT(12*RAND()+1)","v":4},{"$f":"IF(O3=1,1,(IF(AND(INT(K3/2)=K3/2,INT(O3/2)=O3/2),O3+1,O3)))","v":4},{"$f":"IF(AND(INT(K3/3)=K3/3,INT(P3/3)=P3/3 ),P3+1,P3)","v":4},{"$f":"IF(AND(INT(K3/4)=K3/4,INT(Q3/4)=Q3/4 ),Q3+1,Q3)","v":4},{"$f":"IF(AND(INT($K3/5)=$K3/5,INT($R3/5)=$R3/5 ),$R3+1,$R3)","v":4},{"$f":"IF(AND(INT($K3/7)=$K3/7,INT($S3/7)=$S3/7 ),$S3+1,$S3)","v":4},{"$f":"IF(AND(INT(K3/2)=K3/2,INT(T3/2)=T3/2 ),T3+1,T3)","v":4},0,{"$f":"IF(V3=0,\" + \",\" - \")","v":" + "},{"$f":"TEXT(U3,0)","v":"4"},1,0,{"$f":"IF(Z3=0,\"\",\"-\")","v":""},{"$f":"IF(Y3=1,\"\",TEXT(Y3,Y3))","v":""},{"$f":"INT(12*RAND()+1)","v":11},{"$f":"IF(AC3=1,1,(IF(AND(INT(G3/2)=G3/2,INT(AC3/2)=AC3/2),AC3+1,AC3)))","v":11},{"$f":"IF(AND(INT(G3/3)=G3/3,INT(AD3/3)=AD3/3 ),AD3+1,AD3)","v":11},{"$f":"IF(AND(INT(G3/4)=G3/4,INT(AE3/4)=AE3/4 ),AE3+1,AE3)","v":11},{"$f":"IF(AND(INT(G3/5)=G3/5,INT($AF3/5)=$AF3/5 ),$AF3+1,$AF3)","v":11},{"$f":"IF(AND(INT($G3/7)=$G3/7,INT($AG3/7)=$AG3/7 ),$AG3+1,$AG3)","v":11},{"$f":"IF(AND(INT(G3/2)=G3/2,INT(AH3/2)=AH3/2 ),AH3+1,AH3)","v":11},0,0,{"$f":"IF(AK3=0,\" + \",\" - \")","v":" + "},{"$f":"TEXT(AI3,0)","v":"11"},null,{"$f":"K3^2","v":1},{"$f":"IF(AO3=1,\"\",TEXT(AO3,0))","v":""},{"$f":"U3^2","v":16},{"$f":"IF(AQ3=1,\"\",TEXT(AQ3,0))","v":"16"},{"$f":"(-1)^(L3+1)*K3*(-1)^(AK3+1)*AI3+(-1)^(V3+1)*U3*(-1)^(H3+1)*G3","v":15},{"$f":"IF(ABS(AS3)=1,\"\",TEXT(ABS(AS3),0))","v":"15"},{"$f":"IF(AS3<1,\" - \",\" + \")","v":" + "},{"$f":"(-1)^(AK3+1)*AI3*(-1)^(V3+1)*U3","v":44},{"$f":"TEXT(ABS(AV3),0)","v":"44"},{"$f":"IF(AV3<1,\" - \",\" + \")","v":" + "},{"$f":"IF(V3=0,\" - \",\" + \")","v":" - "},null,null,{"$f":"3*INT(3*RAND())","v":0},null,{"$f":"CONCATENATE(\"(\",$N3,$C3,$W3,$X3,,\")\",\"(\",$J3,$C3,$AL3,$AM3,,\")\",\" =\")","v":"(d + 4)(d + 11) ="},{"$f":"CONCATENATE($C3,CHAR(178),$AU3,$AT3,$M3,$C3,$AX3,$AW3)","v":"d² + 15d + 44"},null,{"$f":"CONCATENATE(\"(\",$M3,$N3,$C3,$W3,$X3,,\")\",CHAR(178),\" =\")","v":"(d + 4)² ="},{"$f":"CONCATENATE($C3,CHAR(178),$W3,2*$U3,$M3,$C3,\" + \",($X3)^2)","v":"d² + 8d + 16"},null,{"$f":"CONCATENATE(\"(\",$N3,$C3,$W3,$X3,,\")\",\"(\",$N3,$C3,$AY3,$X3,,\")\",\" =\")","v":"(d + 4)(d - 4) ="},{"$f":"CONCATENATE($C3,CHAR(178),\" - \",($U3)^2)","v":"d² - 16"},null,{"$f":"OFFSET(BD3,0,VALUE(BB3))","v":"(d + 4)(d + 11) ="},{"$f":"OFFSET(BE3,0,VALUE(BB3))","v":"d² + 15d + 44"}]
[2,{"$f":"INT(24*RAND()+97)","v":111},{"$f":"IF(B4=108,CHAR(B4+1),CHAR(B4))","v":"o"},{"$f":"INT(24*RAND()+97)","v":103},{"$f":"IF(D4=B4, D4+1,IF(D4=C4,D4+1,D4))","v":103},{"$f":"IF(E4=108,CHAR(E4+1),CHAR(E4))","v":"g"},1,0,"",{"$f":"IF(G4=1,\"\",TEXT(G4,G4))","v":""},1,0,{"$f":"IF(L4=0,\"\",\"-\")","v":""},{"$f":"IF(K4=1,\"\",TEXT(K4,K4))","v":""},{"$f":"INT(12*RAND()+1)","v":3},{"$f":"IF(O4=1,1,(IF(AND(INT(K4/2)=K4/2,INT(O4/2)=O4/2),O4+1,O4)))","v":3},{"$f":"IF(AND(INT(K4/3)=K4/3,INT(P4/3)=P4/3 ),P4+1,P4)","v":3},{"$f":"IF(AND(INT(K4/4)=K4/4,INT(Q4/4)=Q4/4 ),Q4+1,Q4)","v":3},{"$f":"IF(AND(INT(K4/5)=K4/5,INT(R4/5)=R4/5 ),R4+1,R4)","v":3},{"$f":"IF(AND(INT($K4/7)=$K4/7,INT($S4/7)=$S4/7 ),$S4+1,$S4)","v":3},{"$f":"IF(AND(INT(K4/2)=K4/2,INT(T4/2)=T4/2 ),T4+1,T4)","v":3},0,{"$f":"IF(V4=0,\" + \",\" - \")","v":" + "},{"$f":"TEXT(U4,0)","v":"3"},1,0,{"$f":"IF(Z4=0,\"\",\"-\")","v":""},{"$f":"IF(Y4=1,\"\",TEXT(Y4,Y4))","v":""},{"$f":"INT(12*RAND()+1)","v":9},{"$f":"IF(AC4=1,1,(IF(AND(INT(G4/2)=G4/2,INT(AC4/2)=AC4/2),AC4+1,AC4)))","v":9},{"$f":"IF(AND(INT(G4/3)=G4/3,INT(AD4/3)=AD4/3 ),AD4+1,AD4)","v":9},{"$f":"IF(AND(INT(G4/4)=G4/4,INT(AE4/4)=AE4/4 ),AE4+1,AE4)","v":9},{"$f":"IF(AND(INT(G4/5)=G4/5,INT($AF4/5)=$AF4/5 ),$AF4+1,$AF4)","v":9},{"$f":"IF(AND(INT($G4/7)=$G4/7,INT($AG4/7)=$AG4/7 ),$AG4+1,$AG4)","v":9},{"$f":"IF(AND(INT(G4/2)=G4/2,INT(AH4/2)=AH4/2 ),AH4+1,AH4)","v":9},0,0,{"$f":"IF(AK4=0,\" + \",\" - \")","v":" + "},{"$f":"TEXT(AI4,0)","v":"9"},null,{"$f":"K4^2","v":1},{"$f":"IF(AO4=1,\"\",TEXT(AO4,0))","v":""},{"$f":"U4^2","v":9},{"$f":"IF(AQ4=1,\"\",TEXT(AQ4,0))","v":"9"},{"$f":"(-1)^(L4+1)*K4*(-1)^(AK4+1)*AI4+(-1)^(V4+1)*U4*(-1)^(H4+1)*G4","v":12},{"$f":"IF(ABS(AS4)=1,\"\",TEXT(ABS(AS4),0))","v":"12"},{"$f":"IF(AS4<1,\" - \",\" + \")","v":" + "},{"$f":"(-1)^(AK4+1)*AI4*(-1)^(V4+1)*U4","v":27},{"$f":"TEXT(ABS(AV4),0)","v":"27"},{"$f":"IF(AV4<1,\" - \",\" + \")","v":" + "},{"$f":"IF(V4=0,\" - \",\" + \")","v":" - "},null,null,0,null,{"$f":"CONCATENATE(\"(\",$N4,$C4,$W4,$X4,,\")\",\"(\",$J4,$C4,$AL4,$AM4,,\")\",\" =\")","v":"(o + 3)(o + 9) ="},{"$f":"CONCATENATE($C4,CHAR(178),$AU4,$AT4,$M4,$C4,$AX4,$AW4)","v":"o² + 12o + 27"},null,{"$f":"CONCATENATE(\"(\",$M4,$N4,$C4,$W4,$X4,,\")\",CHAR(178),\" =\")","v":"(o + 3)² ="},{"$f":"CONCATENATE($C4,CHAR(178),$W4,2*$U4,$M4,$C4,\" + \",($X4)^2)","v":"o² + 6o + 9"},null,{"$f":"CONCATENATE(\"(\",$N4,$C4,$W4,$X4,,\")\",\"(\",$N4,$C4,$AY4,$X4,,\")\",\" =\")","v":"(o + 3)(o - 3) ="},{"$f":"CONCATENATE($C4,CHAR(178),\" - \",($U4)^2)","v":"o² - 9"},null,"(o + 3)(o + 9) =","o² + 12o + 27"]
[3,107,"k",110,110,"n",1,0,"","",1,0,"","",4,4,4,4,4,{"$f":"IF(AND(INT($K5/7)=$K5/7,INT($S5/7)=$S5/7 ),$S5+1,$S5)","v":4},{"$f":"IF(AND(INT(K5/2)=K5/2,INT(T5/2)=T5/2 ),T5+1,T5)","v":4},0," + ",{"$f":"TEXT(U5,0)","v":"4"},1,0,"","",4,4,4,4,4,{"$f":"IF(AND(INT($G5/7)=$G5/7,INT($AG5/7)=$AG5/7 ),$AG5+1,$AG5)","v":4},4,0,0," + ",{"$f":"TEXT(AI5,0)","v":"4"},null,1,"",16,"16",8,"8"," + ",16,"16"," + "," - ",null,null,6,null,"(k + 4)(k + 4) =","k² + 8k + 16",null,"(k + 4)² =","k² + 8k + 16",null,"(k + 4)(k - 4) =","k² - 16",null,"(k + 4)(k - 4) =","k² - 16"]
[4,118,"v",100,100,"d",1,0,"","",1,0,"","",4,4,4,4,4,4,4,0," + ","4",1,0,"","",7,7,7,7,7,7,7,0,0," + ","7",null,1,"",16,"16",11,"11"," + ",28,"28"," + "," - ",null,null,3,null,"(v + 4)(v + 7) =","v² + 11v + 28",null,"(v + 4)² =","v² + 8v + 16",null,"(v + 4)(v - 4) =","v² - 16",null,"(v + 4)² =","v² + 8v + 16"]
[5,98,"b",102,102,"f",1,0,"","",1,0,"","",3,3,3,3,3,3,3,0," + ","3",1,0,"","",4,4,4,4,4,4,4,0,0," + ","4",null,1,"",9,"9",7,"7"," + ",12,"12"," + "," - ",null,null,3,null,"(b + 3)(b + 4) =","b² + 7b + 12",null,"(b + 3)² =","b² + 6b + 9",null,"(b + 3)(b - 3) =","b² - 9",null,"(b + 3)² =","b² + 6b + 9"]
[6,106,"j",105,105,"i",1,0,"","",1,0,"","",8,8,8,8,8,8,8,0," + ","8",1,0,"","",7,7,7,7,7,7,7,0,0," + ","7",null,1,"",64,"64",15,"15"," + ",56,"56"," + "," - ",null,null,3,null,"(j + 8)(j + 7) =","j² + 15j + 56",null,"(j + 8)² =","j² + 16j + 64",null,"(j + 8)(j - 8) =","j² - 64",null,"(j + 8)² =","j² + 16j + 64"]
[7,109,"m",101,101,"e",1,0,"","",1,0,"","",9,9,9,9,9,9,9,0," + ","9",1,0,"","",11,11,11,11,11,11,11,0,0," + ","11",null,1,"",81,"81",20,"20"," + ",99,"99"," + "," - ",null,null,3,null,"(m + 9)(m + 11) =","m² + 20m + 99",null,"(m + 9)² =","m² + 18m + 81",null,"(m + 9)(m - 9) =","m² - 81",null,"(m + 9)² =","m² + 18m + 81"]
[8,115,"s",105,105,"i",1,0,"","",1,0,"","",6,6,6,6,6,6,6,0," + ","6",1,0,"","",9,9,9,9,9,9,9,0,0," + ","9",null,1,"",36,"36",15,"15"," + ",54,"54"," + "," - ",null,null,0,null,"(s + 6)(s + 9) =","s² + 15s + 54",null,"(s + 6)² =","s² + 12s + 36",null,"(s + 6)(s - 6) =","s² - 36",null,"(s + 6)(s + 9) =","s² + 15s + 54"]
[9,99,"c",102,102,"f",1,0,"","",1,0,"","",2,2,2,2,2,2,2,0," + ","2",1,0,"","",4,4,4,4,4,4,4,0,0," + ","4",null,1,"",4,"4",6,"6"," + ",8,"8"," + "," - ",null,null,0,null,"(c + 2)(c + 4) =","c² + 6c + 8",null,"(c + 2)² =","c² + 4c + 4",null,"(c + 2)(c - 2) =","c² - 4",null,"(c + 2)(c + 4) =","c² + 6c + 8"]
[10,99,"c",97,97,"a",1,0,"","",1,0,"","",12,12,12,12,12,12,12,0," + ","12",1,0,"","",10,10,10,10,10,10,10,0,0," + ","10",null,1,"",144,"144",22,"22"," + ",120,"120"," + "," - ",null,null,6,null,"(c + 12)(c + 10) =","c² + 22c + 120",null,"(c + 12)² =","c² + 24c + 144",null,"(c + 12)(c - 12) =","c² - 144",null,"(c + 12)(c - 12) =","c² - 144"]
[11,111,"o",100,100,"d",1,0,"","",1,0,"","",5,5,5,5,5,5,5,1," - ","5",1,0,"","",5,5,5,5,5,5,5,1,1," - ","5",null,1,"",25,"25",-10,"10"," - ",25,"25"," + "," + ",null,null,3,null,"(o - 5)(o - 5) =","o² - 10o + 25",null,"(o - 5)² =","o² - 10o + 25",null,"(o - 5)(o + 5) =","o² - 25",null,"(o - 5)² =","o² - 10o + 25"]
[12,111,"o",101,101,"e",1,0,"","",1,0,"","",1,1,1,1,1,1,1,1," - ","1",1,0,"","",1,1,1,1,1,1,1,1,1," - ","1",null,1,"",1,"",-2,"2"," - ",1,"1"," + "," + ",null,null,6,null,"(o - 1)(o - 1) =","o² - 2o + 1",null,"(o - 1)² =","o² - 2o + 1",null,"(o - 1)(o + 1) =","o² - 1",null,"(o - 1)(o + 1) =","o² - 1"]
[13,103,"g",117,117,"u",1,0,"","",1,0,"","",11,11,11,11,11,11,11,1," - ","11",1,0,"","",9,9,9,9,9,9,9,1,1," - ","9",null,1,"",121,"121",-20,"20"," - ",99,"99"," + "," + ",null,null,0,null,"(g - 11)(g - 9) =","g² - 20g + 99",null,"(g - 11)² =","g² - 22g + 121",null,"(g - 11)(g + 11) =","g² - 121",null,"(g - 11)(g - 9) =","g² - 20g + 99"]
[14,111,"o",105,105,"i",1,0,"","",1,0,"","",7,7,7,7,7,7,7,1," - ","7",1,0,"","",3,3,3,3,3,3,3,1,1," - ","3",null,1,"",49,"49",-10,"10"," - ",21,"21"," + "," + ",null,null,6,null,"(o - 7)(o - 3) =","o² - 10o + 21",null,"(o - 7)² =","o² - 14o + 49",null,"(o - 7)(o + 7) =","o² - 49",null,"(o - 7)(o + 7) =","o² - 49"]
[15,98,"b",117,117,"u",1,0,"","",1,0,"","",12,12,12,12,12,12,12,1," - ","12",1,0,"","",3,3,3,3,3,3,3,1,1," - ","3",null,1,"",144,"144",-15,"15"," - ",36,"36"," + "," + ",null,null,3,null,"(b - 12)(b - 3) =","b² - 15b + 36",null,"(b - 12)² =","b² - 24b + 144",null,"(b - 12)(b + 12) =","b² - 144",null,"(b - 12)² =","b² - 24b + 144"]
[16,104,"h",97,97,"a",1,0,"","",1,0,"","",3,3,3,3,3,3,3,1," - ","3",1,0,"","",8,8,8,8,8,8,8,1,1," - ","8",null,1,"",9,"9",-11,"11"," - ",24,"24"," + "," + ",null,null,0,null,"(h - 3)(h - 8) =","h² - 11h + 24",null,"(h - 3)² =","h² - 6h + 9",null,"(h - 3)(h + 3) =","h² - 9",null,"(h - 3)(h - 8) =","h² - 11h + 24"]
[17,102,"f",101,101,"e",1,0,"","",1,0,"","",12,12,12,12,12,12,12,1," - ","12",1,0,"","",1,1,1,1,1,1,1,1,1," - ","1",null,1,"",144,"144",-13,"13"," - ",12,"12"," + "," + ",null,null,0,null,"(f - 12)(f - 1) =","f² - 13f + 12",null,"(f - 12)² =","f² - 24f + 144",null,"(f - 12)(f + 12) =","f² - 144",null,"(f - 12)(f - 1) =","f² - 13f + 12"]
[18,112,"p",117,117,"u",1,0,"","",1,0,"","",3,3,3,3,3,3,3,1," - ","3",1,0,"","",8,8,8,8,8,8,8,1,1," - ","8",null,1,"",9,"9",-11,"11"," - ",24,"24"," + "," + ",null,null,6,null,"(p - 3)(p - 8) =","p² - 11p + 24",null,"(p - 3)² =","p² - 6p + 9",null,"(p - 3)(p + 3) =","p² - 9",null,"(p - 3)(p + 3) =","p² - 9"]
[19,105,"i",108,108,"m",1,0,"","",1,0,"","",6,6,6,6,6,6,6,1," - ","6",1,0,"","",5,5,5,5,5,5,5,1,1," - ","5",null,1,"",36,"36",-11,"11"," - ",30,"30"," + "," + ",null,null,0,null,"(i - 6)(i - 5) =","i² - 11i + 30",null,"(i - 6)² =","i² - 12i + 36",null,"(i - 6)(i + 6) =","i² - 36",null,"(i - 6)(i - 5) =","i² - 11i + 30"]
[20,99,"c",97,97,"a",1,0,"","",1,0,"","",8,8,8,8,8,8,8,1," - ","8",1,0,"","",3,3,3,3,3,3,3,1,1," - ","3",null,1,"",64,"64",-11,"11"," - ",24,"24"," + "," + ",null,null,6,null,"(c - 8)(c - 3) =","c² - 11c + 24",null,"(c - 8)² =","c² - 16c + 64",null,"(c - 8)(c + 8) =","c² - 64",null,"(c - 8)(c + 8) =","c² - 64"]
[21,102,"f",116,116,"t",1,0,"","",1,0,"","",5,5,5,5,5,5,5,{"$f":"INT(2*RAND())","v":0}," + ","5",1,0,"","",6,6,6,6,6,6,6,{"$f":"INT(2*RAND())","v":1},{"$f":"IF((AND(AI23=U23,MOD(AJ23+1,2)=V23)),MOD(AJ23+1,2),AJ23)","v":1}," - ","6",null,1,"",25,"25",-1,""," - ",-30,"30"," - "," - ",null,null,3,null,"(f + 5)(f - 6) =","f² - f - 30",null,"(f + 5)² =","f² + 10f + 25",null,"(f + 5)(f - 5) =","f² - 25",null,"(f + 5)² =","f² + 10f + 25"]
[22,118,"v",104,104,"h",1,0,"","",1,0,"","",2,2,2,2,2,2,2,0," + ","2",1,0,"","",3,3,3,3,3,3,3,0,{"$f":"IF((AND(AI24=U24,MOD(AJ24+1,2)=V24)),MOD(AJ24+1,2),AJ24)","v":0}," + ","3",null,1,"",4,"4",5,"5"," + ",6,"6"," + "," - ",null,null,0,null,"(v + 2)(v + 3) =","v² + 5v + 6",null,"(v + 2)² =","v² + 4v + 4",null,"(v + 2)(v - 2) =","v² - 4",null,"(v + 2)(v + 3) =","v² + 5v + 6"]
[23,100,"d",105,105,"i",1,0,"","",1,0,"","",1,1,1,1,1,1,1,1," - ","1",1,0,"","",3,3,3,3,3,3,3,1,1," - ","3",null,1,"",1,"",-4,"4"," - ",3,"3"," + "," + ",null,null,6,null,"(d - 1)(d - 3) =","d² - 4d + 3",null,"(d - 1)² =","d² - 2d + 1",null,"(d - 1)(d + 1) =","d² - 1",null,"(d - 1)(d + 1) =","d² - 1"]
[24,112,"p",110,110,"n",1,0,"","",1,0,"","",6,6,6,6,6,6,6,1," - ","6",1,0,"","",3,3,3,3,3,3,3,1,1," - ","3",null,1,"",36,"36",-9,"9"," - ",18,"18"," + "," + ",null,null,3,null,"(p - 6)(p - 3) =","p² - 9p + 18",null,"(p - 6)² =","p² - 12p + 36",null,"(p - 6)(p + 6) =","p² - 36",null,"(p - 6)² =","p² - 12p + 36"]
[25,107,"k",118,118,"v",1,0,"","",1,0,"","",5,5,5,5,5,5,5,1," - ","5",1,0,"","",3,3,3,3,3,3,3,1,1," - ","3",null,1,"",25,"25",-8,"8"," - ",15,"15"," + "," + ",null,null,0,null,"(k - 5)(k - 3) =","k² - 8k + 15",null,"(k - 5)² =","k² - 10k + 25",null,"(k - 5)(k + 5) =","k² - 25",null,"(k - 5)(k - 3) =","k² - 8k + 15"]
[26,104,"h",113,113,"q",{"$f":"INT(8*RAND()+2)","v":6},0,"","6",{"$f":"INT(8*RAND()+2)","v":4},0,"","4",{"$f":"INT(7*RAND()+1)","v":1},1,1,1,1,1,1,0," + ","1",{"$f":"INT(8*RAND()+2)","v":9},0,"","9",4,5,5,5,5,5,5,1,1," - ","5",null,16,"16",1,"",-14,"14"," - ",-5,"5"," - "," - ",null,null,6,null,{"$f":"CONCATENATE(\"(\",$N28,$C28,$W28,$X28,,\")\",\"(\",$J28,$C28,$AL28,$AM28,\")\",\" =\")","v":"(4h + 1)(6h - 5) ="},{"$f":"CONCATENATE($K28*$G28,$C28,CHAR(178),$AU28,$AT28,$C28,$AX28,$AW28)","v":"24h² - 14h - 5"},null,{"$f":"CONCATENATE(\"(\",$M28,$N28,$C28,$W28,$X28,,\")\",CHAR(178),\" =\")","v":"(4h + 1)² ="},{"$f":"CONCATENATE($AP28,$C28,CHAR(178),$W28,2*$U28*$K28,$C28,\" + \",$AQ28)","v":"16h² + 8h + 1"},null,{"$f":"CONCATENATE(\"(\",$N28,$C28,$W28,$X28,,\")\",\"(\",$N28,$C28,$AY28,$X28,,\")\",\" =\")","v":"(4h + 1)(4h - 1) ="},{"$f":"CONCATENATE($AP28,$C28,CHAR(178),\" - \",($X28)^2)","v":"16h² - 1"},null,"(4h + 1)(4h - 1) =","16h² - 1"]
[27,108,"m",120,120,"x",8,0,"","8",{"$f":"INT(8*RAND()+2)","v":9},0,"","9",2,2,2,2,2,2,2,0," + ","2",{"$f":"INT(8*RAND()+2)","v":7},0,"","7",12,13,13,13,13,13,13,0,0," + ","13",null,81,"81",4,"4",133,"133"," + ",26,"26"," + "," - ",null,null,6,null,{"$f":"CONCATENATE(\"(\",$N29,$C29,$W29,$X29,,\")\",\"(\",$J29,$C29,$AL29,$AM29,\")\",\" =\")","v":"(9m + 2)(8m + 13) ="},{"$f":"CONCATENATE($K29*$G29,$C29,CHAR(178),$AU29,$AT29,$C29,$AX29,$AW29)","v":"72m² + 133m + 26"},null,{"$f":"CONCATENATE(\"(\",$M29,$N29,$C29,$W29,$X29,,\")\",CHAR(178),\" =\")","v":"(9m + 2)² ="},{"$f":"CONCATENATE($AP29,$C29,CHAR(178),$W29,2*$U29*$K29,$C29,\" + \",$AQ29)","v":"81m² + 36m + 4"},null,{"$f":"CONCATENATE(\"(\",$N29,$C29,$W29,$X29,,\")\",\"(\",$N29,$C29,$AY29,$X29,,\")\",\" =\")","v":"(9m + 2)(9m - 2) ="},{"$f":"CONCATENATE($AP29,$C29,CHAR(178),\" - \",($X29)^2)","v":"81m² - 4"},null,"(9m + 2)(9m - 2) =","81m² - 4"]
[28,104,"h",112,112,"p",4,0,"","4",9,0,"","9",2,2,2,2,2,2,2,0," + ","2",4,0,"","4",9,9,9,9,9,9,9,1,1," - ","9",null,81,"81",4,"4",-73,"73"," - ",-18,"18"," - "," - ",null,null,0,null,"(9h + 2)(4h - 9) =","36h² - 73h - 18",null,"(9h + 2)² =","81h² + 36h + 4",null,"(9h + 2)(9h - 2) =","81h² - 4",null,"(9h + 2)(4h - 9) =","36h² - 73h - 18"]
[29,112,"p",114,114,"r",3,0,"","3",7,0,"","7",5,5,5,5,5,5,5,0," + ","5",6,0,"","6",9,9,10,10,10,10,10,0,0," + ","10",null,49,"49",25,"25",85,"85"," + ",50,"50"," + "," - ",null,null,6,null,"(7p + 5)(3p + 10) =","21p² + 85p + 50",null,"(7p + 5)² =","49p² + 70p + 25",null,"(7p + 5)(7p - 5) =","49p² - 25",null,"(7p + 5)(7p - 5) =","49p² - 25"]
[30,119,"w",120,120,"x",4,0,"","4",2,0,"","2",4,5,5,5,5,5,5,1," - ","5",9,0,"","9",9,9,9,9,9,9,9,0,0," + ","9",null,4,"4",25,"25",-2,"2"," - ",-45,"45"," - "," + ",null,null,0,null,"(2w - 5)(4w + 9) =","8w² - 2w - 45",null,"(2w - 5)² =","4w² - 20w + 25",null,"(2w - 5)(2w + 5) =","4w² - 25",null,"(2w - 5)(4w + 9) =","8w² - 2w - 45"]
[31,100,"d",120,120,"x",3,0,"","3",4,0,"","4",1,1,1,1,1,1,1,1," - ","1",5,0,"","5",10,10,10,10,10,10,10,0,0," + ","10",null,16,"16",1,"",37,"37"," + ",-10,"10"," - "," + ",null,null,6,null,"(4d - 1)(3d + 10) =","12d² + 37d - 10",null,"(4d - 1)² =","16d² - 8d + 1",null,"(4d - 1)(4d + 1) =","16d² - 1",null,"(4d - 1)(4d + 1) =","16d² - 1"]
[32,116,"t",109,109,"m",3,0,"","3",4,0,"","4",1,1,1,1,1,1,1,0," + ","1",3,0,"","3",3,3,4,4,4,4,4,0,0," + ","4",null,16,"16",1,"",19,"19"," + ",4,"4"," + "," - ",null,null,3,null,"(4t + 1)(3t + 4) =","12t² + 19t + 4",null,"(4t + 1)² =","16t² + 8t + 1",null,"(4t + 1)(4t - 1) =","16t² - 1",null,"(4t + 1)² =","16t² + 8t + 1"]
[33,114,"r",107,107,"k",9,0,{"$f":"IF(H35=0,\"\",\"-\")","v":""},"9",8,0,"","8",5,5,5,5,5,5,5,{"$f":"INT(2*RAND())","v":1}," - ","5",6,0,"","6",8,8,8,8,8,8,8,0,0," + ","8",null,64,"64",25,"25",19,"19"," + ",-40,"40"," - "," + ",null,null,{"$f":"3*INT(3*RAND())","v":6},null,"(8r - 5)(9r + 8) =","72r² + 19r - 40",null,"(8r - 5)² =","64r² - 80r + 25",null,"(8r - 5)(8r + 5) =","64r² - 25",null,{"$f":"OFFSET(BD35,0,VALUE(BB35))","v":"(8r - 5)(8r + 5) ="},{"$f":"OFFSET(BE35,0,VALUE(BB35))","v":"64r² - 25"}]
[34,106,"j",108,108,"m",8,0,"","8",3,0,"","3",6,6,7,7,7,7,7,0," + ","7",2,0,"","2",9,9,9,9,9,9,9,0,0," + ","9",null,9,"9",49,"49",83,"83"," + ",63,"63"," + "," - ",null,null,0,null,"(3j + 7)(8j + 9) =","24j² + 83j + 63",null,"(3j + 7)² =","9j² + 42j + 49",null,"(3j + 7)(3j - 7) =","9j² - 49",null,"(3j + 7)(8j + 9) =","24j² + 83j + 63"]
[35,120,"x",99,99,"c",7,0,"","7",6,0,"","6",7,7,7,7,7,7,7,1," - ","7",7,0,"","7",2,2,2,2,2,2,2,0,0," + ","2",null,36,"36",49,"49",-37,"37"," - ",-14,"14"," - "," + ",null,null,0,null,"(6x - 7)(7x + 2) =","42x² - 37x - 14",null,"(6x - 7)² =","36x² - 84x + 49",null,"(6x - 7)(6x + 7) =","36x² - 49",null,"(6x - 7)(7x + 2) =","42x² - 37x - 14"]
[36,97,"a",99,99,"c",5,0,"","5",2,0,"","2",1,1,1,1,1,1,1,1," - ","1",3,0,"","3",5,5,5,5,6,6,6,0,0," + ","6",null,4,"4",1,"",7,"7"," + ",-6,"6"," - "," + ",null,null,6,null,"(2a - 1)(5a + 6) =","10a² + 7a - 6",null,"(2a - 1)² =","4a² - 4a + 1",null,"(2a - 1)(2a + 1) =","4a² - 1",null,"(2a - 1)(2a + 1) =","4a² - 1"]
[37,101,"e",113,113,"q",2,0,"","2",6,0,"","6",7,7,7,7,7,7,7,0," + ","7",9,0,"","9",12,13,13,13,13,13,13,0,0," + ","13",null,36,"36",49,"49",92,"92"," + ",91,"91"," + "," - ",null,null,6,null,"(6e + 7)(2e + 13) =","12e² + 92e + 91",null,"(6e + 7)² =","36e² + 84e + 49",null,"(6e + 7)(6e - 7) =","36e² - 49",null,"(6e + 7)(6e - 7) =","36e² - 49"]
[38,111,"o",120,120,"x",5,0,"","5",4,0,"","4",5,5,5,5,5,5,5,0," + ","5",3,0,"","3",11,11,11,11,11,11,11,1,1," - ","11",null,16,"16",25,"25",-19,"19"," - ",-55,"55"," - "," - ",null,null,6,null,"(4o + 5)(5o - 11) =","20o² - 19o - 55",null,"(4o + 5)² =","16o² + 40o + 25",null,"(4o + 5)(4o - 5) =","16o² - 25",null,"(4o + 5)(4o - 5) =","16o² - 25"]
[39,115,"s",113,113,"q",6,0,"","6",4,0,"","4",5,5,5,5,5,5,5,0," + ","5",8,0,"","8",2,3,4,4,4,4,5,1,0," + ","5",null,16,"16",25,"25",50,"50"," + ",25,"25"," + "," - ",null,null,0,null,"(4s + 5)(6s + 5) =","24s² + 50s + 25",null,"(4s + 5)² =","16s² + 40s + 25",null,"(4s + 5)(4s - 5) =","16s² - 25",null,"(4s + 5)(6s + 5) =","24s² + 50s + 25"]
[40,105,"i",104,104,"h",6,0,"","6",7,0,"","7",1,1,1,1,1,1,1,1," - ","1",2,0,"","2",4,5,5,5,5,5,5,1,1," - ","5",null,49,"49",1,"",-41,"41"," - ",5,"5"," + "," + ",null,null,6,null,"(7i - 1)(6i - 5) =","42i² - 41i + 5",null,"(7i - 1)² =","49i² - 14i + 1",null,"(7i - 1)(7i + 1) =","49i² - 1",null,"(7i - 1)(7i + 1) =","49i² - 1"]
[41,118,"v",113,113,"q",6,0,"","6",7,0,"","7",6,6,6,6,6,6,6,1," - ","6",5,0,"","5",2,3,4,4,4,4,5,0,0," + ","5",null,49,"49",36,"36",-1,""," - ",-30,"30"," - "," + ",null,null,6,null,"(7v - 6)(6v + 5) =","42v² - v - 30",null,"(7v - 6)² =","49v² - 84v + 36",null,"(7v - 6)(7v + 6) =","49v² - 36",null,"(7v - 6)(7v + 6) =","49v² - 36"]
[42,101,"e",109,109,"m",6,0,"","6",4,0,"","4",7,7,7,7,7,7,7,0," + ","7",3,0,"","3",9,9,10,10,10,10,11,0,0," + ","11",null,16,"16",49,"49",86,"86"," + ",77,"77"," + "," - ",null,null,0,null,"(4e + 7)(6e + 11) =","24e² + 86e + 77",null,"(4e + 7)² =","16e² + 56e + 49",null,"(4e + 7)(4e - 7) =","16e² - 49",null,"(4e + 7)(6e + 11) =","24e² + 86e + 77"]
[43,118,"v",112,112,"p",3,0,"","3",9,0,"","9",4,4,4,4,4,4,4,0," + ","4",8,0,"","8",4,4,4,4,4,4,4,1,0," + ","4",null,81,"81",16,"16",48,"48"," + ",16,"16"," + "," - ",null,null,0,null,"(9v + 4)(3v + 4) =","27v² + 48v + 16",null,"(9v + 4)² =","81v² + 72v + 16",null,"(9v + 4)(9v - 4) =","81v² - 16",null,"(9v + 4)(3v + 4) =","27v² + 48v + 16"]
[44,112,"p",112,113,"q",9,0,"","9",5,0,"","5",4,4,4,4,4,4,4,1," - ","4",6,0,"","6",7,7,7,7,7,7,7,1,1," - ","7",null,25,"25",16,"16",-71,"71"," - ",28,"28"," + "," + ",null,null,3,null,"(5p - 4)(9p - 7) =","45p² - 71p + 28",null,"(5p - 4)² =","25p² - 40p + 16",null,"(5p - 4)(5p + 4) =","25p² - 16",null,"(5p - 4)² =","25p² - 40p + 16"]
[45,99,"c",115,115,"s",4,0,"","4",7,0,"","7",2,2,2,2,2,2,2,1," - ","2",2,0,"","2",3,3,3,3,3,3,3,0,0," + ","3",null,49,"49",4,"4",13,"13"," + ",-6,"6"," - "," + ",null,null,3,null,"(7c - 2)(4c + 3) =","28c² + 13c - 6",null,"(7c - 2)² =","49c² - 28c + 4",null,"(7c - 2)(7c + 2) =","49c² - 4",null,"(7c - 2)² =","49c² - 28c + 4"]
[46,113,"q",104,104,"h",4,0,"","4",8,0,"","8",6,7,7,7,7,7,7,0," + ","7",9,0,"","9",11,11,11,11,11,11,11,1,1," - ","11",null,64,"64",49,"49",-60,"60"," - ",-77,"77"," - "," - ",null,null,6,null,"(8q + 7)(4q - 11) =","32q² - 60q - 77",null,"(8q + 7)² =","64q² + 112q + 49",null,"(8q + 7)(8q - 7) =","64q² - 49",null,"(8q + 7)(8q - 7) =","64q² - 49"]
[47,98,"b",116,116,"t",4,0,"","4",9,0,"","9",2,2,2,2,2,2,2,0," + ","2",9,0,"","9",3,3,3,3,3,3,3,1,1," - ","3",null,81,"81",4,"4",-19,"19"," - ",-6,"6"," - "," - ",null,null,0,null,"(9b + 2)(4b - 3) =","36b² - 19b - 6",null,"(9b + 2)² =","81b² + 36b + 4",null,"(9b + 2)(9b - 2) =","81b² - 4",null,"(9b + 2)(4b - 3) =","36b² - 19b - 6"]
[48,117,"u",112,112,"p",3,0,"","3",5,0,"","5",5,5,5,5,6,6,6,1," - ","6",3,0,"","3",8,8,8,8,8,8,8,0,0," + ","8",null,25,"25",36,"36",22,"22"," + ",-48,"48"," - "," + ",null,null,6,null,"(5u - 6)(3u + 8) =","15u² + 22u - 48",null,"(5u - 6)² =","25u² - 60u + 36",null,"(5u - 6)(5u + 6) =","25u² - 36",null,"(5u - 6)(5u + 6) =","25u² - 36"]
[49,99,"c",107,107,"k",7,0,"","7",2,0,"","2",2,3,3,3,3,3,3,1," - ","3",6,0,"","6",5,5,5,5,5,5,5,1,1," - ","5",null,4,"4",9,"9",-31,"31"," - ",15,"15"," + "," + ",null,null,0,null,"(2c - 3)(7c - 5) =","14c² - 31c + 15",null,"(2c - 3)² =","4c² - 12c + 9",null,"(2c - 3)(2c + 3) =","4c² - 9",null,"(2c - 3)(7c - 5) =","14c² - 31c + 15"]
[50,113,"q",99,99,"c",3,0,"","3",4,0,"","4",7,7,7,7,7,7,7,1," - ","7",6,0,"","6",9,9,10,10,10,10,10,1,1," - ","10",null,16,"16",49,"49",-61,"61"," - ",70,"70"," + "," + ",null,null,6,null,"(4q - 7)(3q - 10) =","12q² - 61q + 70",null,"(4q - 7)² =","16q² - 56q + 49",null,"(4q - 7)(4q + 7) =","16q² - 49",null,"(4q - 7)(4q + 7) =","16q² - 49"]
[51,105,"i",118,118,"v",{"$f":"INT(9*RAND()+1)","v":5},0,"","5",{"$f":"INT(9*RAND()+1)","v":3},0,"","3",4,4,4,4,4,4,4,1," - ",{"$f":"IF(U53=1,\"\",TEXT(U53,0))","v":"4"},{"$f":"INT(9*RAND()+1)","v":5},0,"","5",7,7,7,7,7,7,7,1,1," - ",{"$f":"IF(AI53=1,\"\",TEXT(AI53,0))","v":"7"},null,9,"9",16,"16",-41,"41"," - ",28,{"$f":"IF(AV53=1,\"\",TEXT(ABS(AV53),0))","v":"28"}," + "," + ",null,null,6,null,{"$f":"CONCATENATE(\"(\",$N53,$C53,$W53,$X53,$F53,\")\",\"(\",$J53,$C53,$AL53,$AM53,$F53,\")\",\" =\")","v":"(3i - 4v)(5i - 7v) ="},{"$f":"CONCATENATE($K53*$G53,$C53,CHAR(178),$AU53,$AT53,$C53,$F53,$AX53,$AW53,$F53,CHAR(178))","v":"15i² - 41iv + 28v²"},null,{"$f":"CONCATENATE(\"(\",$N53,$C53,$W53,$X53,$F53,\")\",CHAR(178),\" =\")","v":"(3i - 4v)² ="},{"$f":"CONCATENATE($AP53,$C53,CHAR(178),$W53,2*$U53*$K53,$C53,$F53,\" + \",$AR53,$F53,CHAR(178))","v":"9i² - 24iv + 16v²"},null,{"$f":"CONCATENATE(\"(\",$N53,$C53,$W53,$X53,$F53,\")\",\"(\",$N53,$C53,$AY53,$X53,$F53,\")\",\" =\")","v":"(3i - 4v)(3i + 4v) ="},{"$f":"CONCATENATE($AP53,$C53,CHAR(178),\" - \",($AR53),$F53,CHAR(178))","v":"9i² - 16v²"},null,"(3i - 4v)(3i + 4v) =","9i² - 16v²"]
[52,112,"p",113,113,"q",8,0,"","8",8,0,"","8",7,7,7,7,7,7,7,0," + ",{"$f":"IF(U54=1,\"\",TEXT(U54,0))","v":"7"},8,0,"","8",4,5,5,5,5,5,5,0,0," + ",{"$f":"IF(AI54=1,\"\",TEXT(AI54,0))","v":"5"},null,64,"64",49,"49",96,"96"," + ",35,"35"," + "," - ",null,null,0,null,{"$f":"CONCATENATE(\"(\",$N54,$C54,$W54,$X54,$F54,\")\",\"(\",$J54,$C54,$AL54,$AM54,$F54,\")\",\" =\")","v":"(8p + 7q)(8p + 5q) ="},{"$f":"CONCATENATE($K54*$G54,$C54,CHAR(178),$AU54,$AT54,$C54,$F54,$AX54,$AW54,$F54,CHAR(178))","v":"64p² + 96pq + 35q²"},null,{"$f":"CONCATENATE(\"(\",$N54,$C54,$W54,$X54,$F54,\")\",CHAR(178),\" =\")","v":"(8p + 7q)² ="},{"$f":"CONCATENATE($AP54,$C54,CHAR(178),$W54,2*$U54*$K54,$C54,$F54,\" + \",$AR54,$F54,CHAR(178))","v":"64p² + 112pq + 49q²"},null,{"$f":"CONCATENATE(\"(\",$N54,$C54,$W54,$X54,$F54,\")\",\"(\",$N54,$C54,$AY54,$X54,$F54,\")\",\" =\")","v":"(8p + 7q)(8p - 7q) ="},{"$f":"CONCATENATE($AP54,$C54,CHAR(178),\" - \",($AR54),$F54,CHAR(178))","v":"64p² - 49q²"},null,"(8p + 7q)(8p + 5q) =","64p² + 96pq + 35q²"]
[53,116,"t",97,97,"a",4,0,"","4",6,0,"","6",7,7,7,7,7,7,7,0," + ","7",4,0,"","4",6,7,7,7,7,7,7,0,0," + ","7",null,36,"36",49,"49",70,"70"," + ",49,"49"," + "," - ",null,null,0,null,"(6t + 7a)(4t + 7a) =","24t² + 70ta + 49a²",null,"(6t + 7a)² =","36t² + 84ta + 49a²",null,"(6t + 7a)(6t - 7a) =","36t² - 49a²",null,"(6t + 7a)(4t + 7a) =","24t² + 70ta + 49a²"]
[54,106,"j",100,100,"d",3,0,"","3",1,0,"","",6,6,6,6,6,6,6,0," + ","6",2,0,"","2",8,8,8,8,8,8,8,1,1," - ","8",null,1,"",36,"36",10,"10"," + ",-48,"48"," - "," - ",null,null,6,null,"(j + 6d)(3j - 8d) =","3j² + 10jd - 48d²",null,"(j + 6d)² =","j² + 12jd + 36d²",null,"(j + 6d)(j - 6d) =","j² - 36d²",null,"(j + 6d)(j - 6d) =","j² - 36d²"]
[55,111,"o",105,105,"i",1,0,"","",9,0,"","9",4,4,4,4,4,4,4,0," + ","4",6,0,"","6",6,6,6,6,6,6,6,0,0," + ","6",null,81,"81",16,"16",58,"58"," + ",24,"24"," + "," - ",null,null,6,null,"(9o + 4i)(o + 6i) =","9o² + 58oi + 24i²",null,"(9o + 4i)² =","81o² + 72oi + 16i²",null,"(9o + 4i)(9o - 4i) =","81o² - 16i²",null,"(9o + 4i)(9o - 4i) =","81o² - 16i²"]
[56,103,"g",97,97,"a",8,0,"","8",9,0,"","9",3,3,4,4,4,4,4,1," - ","4",2,0,"","2",9,9,9,9,9,9,9,0,0," + ","9",null,81,"81",16,"16",49,"49"," + ",-36,"36"," - "," + ",null,null,6,null,"(9g - 4a)(8g + 9a) =","72g² + 49ga - 36a²",null,"(9g - 4a)² =","81g² - 72ga + 16a²",null,"(9g - 4a)(9g + 4a) =","81g² - 16a²",null,"(9g - 4a)(9g + 4a) =","81g² - 16a²"]
[57,111,"o",99,99,"c",2,0,"","2",6,0,"","6",7,7,7,7,7,7,7,0," + ","7",1,0,"","",5,5,5,5,5,5,5,0,0," + ","5",null,36,"36",49,"49",44,"44"," + ",35,"35"," + "," - ",null,null,3,null,"(6o + 7c)(2o + 5c) =","12o² + 44oc + 35c²",null,"(6o + 7c)² =","36o² + 84oc + 49c²",null,"(6o + 7c)(6o - 7c) =","36o² - 49c²",null,"(6o + 7c)² =","36o² + 84oc + 49c²"]
[58,114,"r",113,113,"q",5,0,"","5",9,0,"","9",1,1,1,1,1,1,1,0," + ","",3,0,"","3",11,11,11,11,11,11,11,0,0," + ","11",null,81,"81",1,"",104,"104"," + ",11,"11"," + "," - ",null,null,3,null,"(9r + q)(5r + 11q) =","45r² + 104rq + 11q²",null,"(9r + q)² =","81r² + 18rq + q²",null,"(9r + q)(9r - q) =","81r² - q²",null,"(9r + q)² =","81r² + 18rq + q²"]
[59,110,"n",97,97,"a",8,0,"","8",8,0,"","8",7,7,7,7,7,7,7,0," + ","7",1,0,"","",5,5,5,5,5,5,5,0,0," + ","5",null,64,"64",49,"49",96,"96"," + ",35,"35"," + "," - ",null,null,6,null,"(8n + 7a)(8n + 5a) =","64n² + 96na + 35a²",null,"(8n + 7a)² =","64n² + 112na + 49a²",null,"(8n + 7a)(8n - 7a) =","64n² - 49a²",null,"(8n + 7a)(8n - 7a) =","64n² - 49a²"]
[60,102,"f",116,116,"t",3,0,"","3",5,0,"","5",6,6,6,6,6,6,6,0," + ","6",3,0,"","3",4,4,4,4,4,4,4,0,0," + ","4",null,25,"25",36,"36",38,"38"," + ",24,"24"," + "," - ",null,null,3,null,"(5f + 6t)(3f + 4t) =","15f² + 38ft + 24t²",null,"(5f + 6t)² =","25f² + 60ft + 36t²",null,"(5f + 6t)(5f - 6t) =","25f² - 36t²",null,"(5f + 6t)² =","25f² + 60ft + 36t²"]
[61,120,"x",114,114,"r",2,0,"","2",5,0,"","5",1,1,1,1,1,1,1,1," - ","",5,0,"","5",10,11,11,11,11,11,11,0,0," + ","11",null,25,"25",1,"",53,"53"," + ",-11,"11"," - "," + ",null,null,3,null,"(5x - r)(2x + 11r) =","10x² + 53xr - 11r²",null,"(5x - r)² =","25x² - 10xr + r²",null,"(5x - r)(5x + r) =","25x² - r²",null,"(5x - r)² =","25x² - 10xr + r²"]
[62,99,"c",108,108,"m",1,0,"","",8,0,"","8",6,7,7,7,7,7,7,1," - ","7",7,0,"","7",3,3,3,3,3,3,3,1,1," - ","3",null,64,"64",49,"49",-31,"31"," - ",21,"21"," + "," + ",null,null,6,null,"(8c - 7m)(c - 3m) =","8c² - 31cm + 21m²",null,"(8c - 7m)² =","64c² - 112cm + 49m²",null,"(8c - 7m)(8c + 7m) =","64c² - 49m²",null,"(8c - 7m)(8c + 7m) =","64c² - 49m²"]
[63,111,"o",102,102,"f",6,0,"","6",6,0,"","6",2,3,4,4,4,4,5,0," + ","5",5,0,"","5",3,3,4,4,4,4,5,1,0," + ","5",null,36,"36",25,"25",60,"60"," + ",25,"25"," + "," - ",null,null,0,null,"(6o + 5f)(6o + 5f) =","36o² + 60of + 25f²",null,"(6o + 5f)² =","36o² + 60of + 25f²",null,"(6o + 5f)(6o - 5f) =","36o² - 25f²",null,"(6o + 5f)(6o + 5f) =","36o² + 60of + 25f²"]
[64,99,"c",100,100,"d",6,0,"","6",1,0,"","",4,4,4,4,4,4,4,1," - ","4",3,0,"","3",7,7,7,7,7,7,7,1,1," - ","7",null,1,"",16,"16",-31,"31"," - ",28,"28"," + "," + ",null,null,3,null,"(c - 4d)(6c - 7d) =","6c² - 31cd + 28d²",null,"(c - 4d)² =","c² - 8cd + 16d²",null,"(c - 4d)(c + 4d) =","c² - 16d²",null,"(c - 4d)² =","c² - 8cd + 16d²"]
[65,103,"g",113,113,"q",4,0,{"$f":"IF(H67=0,\"\",\"-\")","v":""},"4",{"$f":"INT(9*RAND()+1)","v":2},0,"","2",4,5,5,5,5,5,5,{"$f":"INT(2*RAND())","v":0}," + ","5",4,0,"","4",11,11,11,11,11,11,11,0,0," + ","11",null,4,"4",25,"25",42,"42"," + ",55,"55"," + "," - ",null,null,{"$f":"3*INT(3*RAND())","v":3},null,"(2g + 5q)(4g + 11q) =","8g² + 42gq + 55q²",null,"(2g + 5q)² =","4g² + 20gq + 25q²",null,"(2g + 5q)(2g - 5q) =","4g² - 25q²",null,{"$f":"OFFSET(BD67,0,VALUE(BB67))","v":"(2g + 5q)² ="},{"$f":"OFFSET(BE67,0,VALUE(BB67))","v":"4g² + 20gq + 25q²"}]
[66,{"$f":"INT(24*RAND()+97)","v":120},{"$f":"IF(B68=108,CHAR(B68+1),CHAR(B68))","v":"x"},{"$f":"INT(24*RAND()+97)","v":111},{"$f":"IF(D68=B68, D68+1,IF(D68=C68,D68+1,D68))","v":111},{"$f":"IF(E68=108,CHAR(E68+1),CHAR(E68))","v":"o"},4,0,"",{"$f":"IF(G68=1,\"\",TEXT(G68,G68))","v":"4"},4,0,{"$f":"IF(L68=0,\"\",\"-\")","v":""},{"$f":"IF(K68=1,\"\",TEXT(K68,K68))","v":"4"},{"$f":"INT(7*RAND()+1)","v":4},{"$f":"IF(O68=1,1,(IF(AND(INT(K68/2)=K68/2,INT(O68/2)=O68/2),O68+1,O68)))","v":5},{"$f":"IF(AND(INT(K68/3)=K68/3,INT(P68/3)=P68/3 ),P68+1,P68)","v":5},{"$f":"IF(AND(INT(K68/4)=K68/4,INT(Q68/4)=Q68/4 ),Q68+1,Q68)","v":5},{"$f":"IF(AND(INT(K68/5)=K68/5,INT(R68/5)=R68/5 ),R68+1,R68)","v":5},5,5,1,{"$f":"IF(V68=0,\" + \",\" - \")","v":" - "},"5",1,0,{"$f":"IF(Z68=0,\"\",\"-\")","v":""},{"$f":"IF(Y68=1,\"\",TEXT(Y68,Y68))","v":""},{"$f":"INT(12*RAND()+1)","v":11},{"$f":"IF(AC68=1,1,(IF(AND(INT(G68/2)=G68/2,INT(AC68/2)=AC68/2),AC68+1,AC68)))","v":11},{"$f":"IF(AND(INT(G68/3)=G68/3,INT(AD68/3)=AD68/3 ),AD68+1,AD68)","v":11},{"$f":"IF(AND(INT(G68/4)=G68/4,INT(AE68/4)=AE68/4 ),AE68+1,AE68)","v":11},{"$f":"IF(AND(INT(G68/5)=G68/5,INT($AF68/5)=$AF68/5 ),$AF68+1,$AF68)","v":11},11,{"$f":"IF(AND(INT(G68/2)=G68/2,INT(AH68/2)=AH68/2 ),AH68+1,AH68)","v":11},1,1,{"$f":"IF(AK68=0,\" + \",\" - \")","v":" - "},"11",null,{"$f":"K68^2","v":16},{"$f":"IF(AO68=1,\"\",TEXT(AO68,0))","v":"16"},{"$f":"U68^2","v":25},{"$f":"IF(AQ68=1,\"\",TEXT(AQ68,0))","v":"25"},{"$f":"(-1)^(L68+1)*K68*(-1)^(AK68+1)*AI68+(-1)^(V68+1)*U68*(-1)^(H68+1)*G68","v":-64},{"$f":"IF(ABS(AS68)=1,\"\",TEXT(ABS(AS68),0))","v":"64"},{"$f":"IF(AS68<1,\" - \",\" + \")","v":" - "},{"$f":"(-1)^(AK68+1)*AI68*(-1)^(V68+1)*U68","v":55},{"$f":"IF(AV68=1,\"\",TEXT(ABS(AV68),0))","v":"55"},{"$f":"IF(AV68<1,\" - \",\" + \")","v":" + "},{"$f":"IF(V68=0,\" - \",\" + \")","v":" + "},null,null,6,null,"(4x - 5o)(4x - 11o) =","16x² - 64xo + 55o²",null,"(4x - 5o)² =","16x² - 40xo + 25o²",null,"(4x - 5o)(4x + 5o) =","16x² - 25o²",null,"(4x - 5o)(4x + 5o) =","16x² - 25o²"]
[67,105,"i",107,107,"k",2,0,"","2",4,0,"","4",3,3,3,3,3,{"$f":"IF(AND(INT($K69/7)=$K69/7,INT($S69/7)=$S69/7 ),$S69+1,$S69)","v":3},{"$f":"IF(AND(INT(K69/2)=K69/2,INT(T69/2)=T69/2 ),T69+1,T69)","v":3},0," + ","3",9,0,"","9",8,9,9,9,9,{"$f":"IF(AND(INT($G69/7)=$G69/7,INT($AG69/7)=$AG69/7 ),$AG69+1,$AG69)","v":9},9,1,1," - ","9",null,16,"16",9,"9",-30,"30"," - ",-27,"27"," - "," - ",null,null,3,null,"(4i + 3k)(2i - 9k) =","8i² - 30ik - 27k²",null,"(4i + 3k)² =","16i² + 24ik + 9k²",null,"(4i + 3k)(4i - 3k) =","16i² - 9k²",null,"(4i + 3k)² =","16i² + 24ik + 9k²"]
[68,108,"m",97,97,"a",3,0,"","3",1,0,"","",3,3,3,3,3,3,3,1," - ","3",9,0,"","9",2,2,2,2,2,2,2,1,1," - ","2",null,1,"",9,"9",-11,"11"," - ",6,"6"," + "," + ",null,null,0,null,"(m - 3a)(3m - 2a) =","3m² - 11ma + 6a²",null,"(m - 3a)² =","m² - 6ma + 9a²",null,"(m - 3a)(m + 3a) =","m² - 9a²",null,"(m - 3a)(3m - 2a) =","3m² - 11ma + 6a²"]
[69,117,"u",106,106,"j",1,0,"","",6,0,"","6",7,7,7,7,7,7,7,1," - ","7",9,0,"","9",4,4,4,4,4,4,4,1,1," - ","4",null,36,"36",49,"49",-31,"31"," - ",28,"28"," + "," + ",null,null,0,null,"(6u - 7j)(u - 4j) =","6u² - 31uj + 28j²",null,"(6u - 7j)² =","36u² - 84uj + 49j²",null,"(6u - 7j)(6u + 7j) =","36u² - 49j²",null,"(6u - 7j)(u - 4j) =","6u² - 31uj + 28j²"]
[70,119,"w",119,120,"x",5,0,"","5",8,0,"","8",5,5,5,5,5,5,5,1," - ","5",9,0,"","9",6,6,6,6,6,6,6,1,1," - ","6",null,64,"64",25,"25",-73,"73"," - ",30,"30"," + "," + ",null,null,6,null,"(8w - 5x)(5w - 6x) =","40w² - 73wx + 30x²",null,"(8w - 5x)² =","64w² - 80wx + 25x²",null,"(8w - 5x)(8w + 5x) =","64w² - 25x²",null,"(8w - 5x)(8w + 5x) =","64w² - 25x²"]
[71,104,"h",108,108,"m",2,0,"","2",2,0,"","2",6,7,7,7,7,7,7,1," - ","7",9,0,"","9",8,9,9,9,9,9,9,0,0," + ","9",null,4,"4",49,"49",4,"4"," + ",-63,"63"," - "," + ",null,null,6,null,"(2h - 7m)(2h + 9m) =","4h² + 4hm - 63m²",null,"(2h - 7m)² =","4h² - 28hm + 49m²",null,"(2h - 7m)(2h + 7m) =","4h² - 49m²",null,"(2h - 7m)(2h + 7m) =","4h² - 49m²"]
[72,103,"g",118,118,"v",7,0,"","7",1,0,"","",7,7,7,7,7,7,7,0," + ","7",8,0,"","8",5,5,5,5,5,5,5,1,1," - ","5",null,1,"",49,"49",44,"44"," + ",-35,"35"," - "," - ",null,null,0,null,"(g + 7v)(7g - 5v) =","7g² + 44gv - 35v²",null,"(g + 7v)² =","g² + 14gv + 49v²",null,"(g + 7v)(g - 7v) =","g² - 49v²",null,"(g + 7v)(7g - 5v) =","7g² + 44gv - 35v²"]
[73,98,"b",107,107,"k",4,0,"","4",1,0,"","",4,4,4,4,4,4,4,0," + ","4",5,0,"","5",8,9,9,9,9,9,9,0,0," + ","9",null,1,"",16,"16",25,"25"," + ",36,"36"," + "," - ",null,null,3,null,"(b + 4k)(4b + 9k) =","4b² + 25bk + 36k²",null,"(b + 4k)² =","b² + 8bk + 16k²",null,"(b + 4k)(b - 4k) =","b² - 16k²",null,"(b + 4k)² =","b² + 8bk + 16k²"]
[74,114,"r",119,119,"w",1,0,"","",9,0,"","9",1,1,1,1,1,1,1,0," + ","",5,0,"","5",7,7,7,7,7,7,7,1,1," - ","7",null,81,"81",1,"",-62,"62"," - ",-7,"7"," - "," - ",null,null,3,null,"(9r + w)(r - 7w) =","9r² - 62rw - 7w²",null,"(9r + w)² =","81r² + 18rw + w²",null,"(9r + w)(9r - w) =","81r² - w²",null,"(9r + w)² =","81r² + 18rw + w²"]
[75,100,"d",112,112,"p",2,0,"","2",5,0,"","5",6,6,6,6,6,6,6,1," - ","6",3,0,"","3",7,7,7,7,7,7,7,0,0," + ","7",null,25,"25",36,"36",23,"23"," + ",-42,"42"," - "," + ",null,null,0,null,"(5d - 6p)(2d + 7p) =","10d² + 23dp - 42p²",null,"(5d - 6p)² =","25d² - 60dp + 36p²",null,"(5d - 6p)(5d + 6p) =","25d² - 36p²",null,"(5d - 6p)(2d + 7p) =","10d² + 23dp - 42p²"]

{"sheet":"Worksheet","index":2,"n_rows":28,"n_cols":6,"rows_kept":28,"cut":false,"hidden":false,"merged":[]}
[null,null,null,"BINOMIAL EXPANSIONS"]
[null,null,null,null,{"$f":"CONCATENATE(\"Worksheet \",Working!D1,Working!C1)","v":"Worksheet QT-568"}]
["Expand the following;"]
[{"$f":"CONCATENATE(Working!$A3,\")\")","v":"1)"},{"$f":"(Working!$BM3)","v":"(d + 4)(d + 11) ="},{"$f":"CONCATENATE(Working!$A28,\")\")","v":"26)"},{"$f":"(Working!$BM28)","v":"(4h + 1)(4h - 1) ="},{"$f":"CONCATENATE(Working!$A53,\")\")","v":"51)"},{"$f":"(Working!$BM53)","v":"(3i - 4v)(3i + 4v) ="}]
[{"$f":"CONCATENATE(Working!$A4,\")\")","v":"2)"},{"$f":"(Working!$BM4)","v":"(o + 3)(o + 9) ="},{"$f":"CONCATENATE(Working!$A29,\")\")","v":"27)"},{"$f":"(Working!$BM29)","v":"(9m + 2)(9m - 2) ="},{"$f":"CONCATENATE(Working!$A54,\")\")","v":"52)"},{"$f":"(Working!$BM54)","v":"(8p + 7q)(8p + 5q) ="}]
[{"$f":"CONCATENATE(Working!$A5,\")\")","v":"3)"},{"$f":"(Working!$BM5)","v":"(k + 4)(k - 4) ="},{"$f":"CONCATENATE(Working!$A30,\")\")","v":"28)"},{"$f":"(Working!$BM30)","v":"(9h + 2)(4h - 9) ="},{"$f":"CONCATENATE(Working!$A55,\")\")","v":"53)"},{"$f":"(Working!$BM55)","v":"(6t + 7a)(4t + 7a) ="}]
[{"$f":"CONCATENATE(Working!$A6,\")\")","v":"4)"},{"$f":"(Working!$BM6)","v":"(v + 4)² ="},{"$f":"CONCATENATE(Working!$A31,\")\")","v":"29)"},{"$f":"(Working!$BM31)","v":"(7p + 5)(7p - 5) ="},{"$f":"CONCATENATE(Working!$A56,\")\")","v":"54)"},{"$f":"(Working!$BM56)","v":"(j + 6d)(j - 6d) ="}]
[{"$f":"CONCATENATE(Working!$A7,\")\")","v":"5)"},{"$f":"(Working!$BM7)","v":"(b + 3)² ="},{"$f":"CONCATENATE(Working!$A32,\")\")","v":"30)"},{"$f":"(Working!$BM32)","v":"(2w - 5)(4w + 9) ="},{"$f":"CONCATENATE(Working!$A57,\")\")","v":"55)"},{"$f":"(Working!$BM57)","v":"(9o + 4i)(9o - 4i) ="}]
[{"$f":"CONCATENATE(Working!$A8,\")\")","v":"6)"},{"$f":"(Working!$BM8)","v":"(j + 8)² ="},{"$f":"CONCATENATE(Working!$A33,\")\")","v":"31)"},{"$f":"(Working!$BM33)","v":"(4d - 1)(4d + 1) ="},{"$f":"CONCATENATE(Working!$A58,\")\")","v":"56)"},{"$f":"(Working!$BM58)","v":"(9g - 4a)(9g + 4a) ="}]
[{"$f":"CONCATENATE(Working!$A9,\")\")","v":"7)"},{"$f":"(Working!$BM9)","v":"(m + 9)² ="},{"$f":"CONCATENATE(Working!$A34,\")\")","v":"32)"},{"$f":"(Working!$BM34)","v":"(4t + 1)² ="},{"$f":"CONCATENATE(Working!$A59,\")\")","v":"57)"},{"$f":"(Working!$BM59)","v":"(6o + 7c)² ="}]
[{"$f":"CONCATENATE(Working!$A10,\")\")","v":"8)"},{"$f":"(Working!$BM10)","v":"(s + 6)(s + 9) ="},{"$f":"CONCATENATE(Working!$A35,\")\")","v":"33)"},{"$f":"(Working!$BM35)","v":"(8r - 5)(8r + 5) ="},{"$f":"CONCATENATE(Working!$A60,\")\")","v":"58)"},{"$f":"(Working!$BM60)","v":"(9r + q)² ="}]
[{"$f":"CONCATENATE(Working!$A11,\")\")","v":"9)"},{"$f":"(Working!$BM11)","v":"(c + 2)(c + 4) ="},{"$f":"CONCATENATE(Working!$A36,\")\")","v":"34)"},{"$f":"(Working!$BM36)","v":"(3j + 7)(8j + 9) ="},{"$f":"CONCATENATE(Working!$A61,\")\")","v":"59)"},{"$f":"(Working!$BM61)","v":"(8n + 7a)(8n - 7a) ="}]
[{"$f":"CONCATENATE(Working!$A12,\")\")","v":"10)"},{"$f":"(Working!$BM12)","v":"(c + 12)(c - 12) ="},{"$f":"CONCATENATE(Working!$A37,\")\")","v":"35)"},{"$f":"(Working!$BM37)","v":"(6x - 7)(7x + 2) ="},{"$f":"CONCATENATE(Working!$A62,\")\")","v":"60)"},{"$f":"(Working!$BM62)","v":"(5f + 6t)² ="}]
[{"$f":"CONCATENATE(Working!$A13,\")\")","v":"11)"},{"$f":"(Working!$BM13)","v":"(o - 5)² ="},{"$f":"CONCATENATE(Working!$A38,\")\")","v":"36)"},{"$f":"(Working!$BM38)","v":"(2a - 1)(2a + 1) ="},{"$f":"CONCATENATE(Working!$A63,\")\")","v":"61)"},{"$f":"(Working!$BM63)","v":"(5x - r)² ="}]
[{"$f":"CONCATENATE(Working!$A14,\")\")","v":"12)"},{"$f":"(Working!$BM14)","v":"(o - 1)(o + 1) ="},{"$f":"CONCATENATE(Working!$A39,\")\")","v":"37)"},{"$f":"(Working!$BM39)","v":"(6e + 7)(6e - 7) ="},{"$f":"CONCATENATE(Working!$A64,\")\")","v":"62)"},{"$f":"(Working!$BM64)","v":"(8c - 7m)(8c + 7m) ="}]
[{"$f":"CONCATENATE(Working!$A15,\")\")","v":"13)"},{"$f":"(Working!$BM15)","v":"(g - 11)(g - 9) ="},{"$f":"CONCATENATE(Working!$A40,\")\")","v":"38)"},{"$f":"(Working!$BM40)","v":"(4o + 5)(4o - 5) ="},{"$f":"CONCATENATE(Working!$A65,\")\")","v":"63)"},{"$f":"(Working!$BM65)","v":"(6o + 5f)(6o + 5f) ="}]
[{"$f":"CONCATENATE(Working!$A16,\")\")","v":"14)"},{"$f":"(Working!$BM16)","v":"(o - 7)(o + 7) ="},{"$f":"CONCATENATE(Working!$A41,\")\")","v":"39)"},{"$f":"(Working!$BM41)","v":"(4s + 5)(6s + 5) ="},{"$f":"CONCATENATE(Working!$A66,\")\")","v":"64)"},{"$f":"(Working!$BM66)","v":"(c - 4d)² ="}]
[{"$f":"CONCATENATE(Working!$A17,\")\")","v":"15)"},{"$f":"(Working!$BM17)","v":"(b - 12)² ="},{"$f":"CONCATENATE(Working!$A42,\")\")","v":"40)"},{"$f":"(Working!$BM42)","v":"(7i - 1)(7i + 1) ="},{"$f":"CONCATENATE(Working!$A67,\")\")","v":"65)"},{"$f":"(Working!$BM67)","v":"(2g + 5q)² ="}]
[{"$f":"CONCATENATE(Working!$A18,\")\")","v":"16)"},{"$f":"(Working!$BM18)","v":"(h - 3)(h - 8) ="},{"$f":"CONCATENATE(Working!$A43,\")\")","v":"41)"},{"$f":"(Working!$BM43)","v":"(7v - 6)(7v + 6) ="},{"$f":"CONCATENATE(Working!$A68,\")\")","v":"66)"},{"$f":"(Working!$BM68)","v":"(4x - 5o)(4x + 5o) ="}]
[{"$f":"CONCATENATE(Working!$A19,\")\")","v":"17)"},{"$f":"(Working!$BM19)","v":"(f - 12)(f - 1) ="},{"$f":"CONCATENATE(Working!$A44,\")\")","v":"42)"},{"$f":"(Working!$BM44)","v":"(4e + 7)(6e + 11) ="},{"$f":"CONCATENATE(Working!$A69,\")\")","v":"67)"},{"$f":"(Working!$BM69)","v":"(4i + 3k)² ="}]
[{"$f":"CONCATENATE(Working!$A20,\")\")","v":"18)"},{"$f":"(Working!$BM20)","v":"(p - 3)(p + 3) ="},{"$f":"CONCATENATE(Working!$A45,\")\")","v":"43)"},{"$f":"(Working!$BM45)","v":"(9v + 4)(3v + 4) ="},{"$f":"CONCATENATE(Working!$A70,\")\")","v":"68)"},{"$f":"(Working!$BM70)","v":"(m - 3a)(3m - 2a) ="}]
[{"$f":"CONCATENATE(Working!$A21,\")\")","v":"19)"},{"$f":"(Working!$BM21)","v":"(i - 6)(i - 5) ="},{"$f":"CONCATENATE(Working!$A46,\")\")","v":"44)"},{"$f":"(Working!$BM46)","v":"(5p - 4)² ="},{"$f":"CONCATENATE(Working!$A71,\")\")","v":"69)"},{"$f":"(Working!$BM71)","v":"(6u - 7j)(u - 4j) ="}]
[{"$f":"CONCATENATE(Working!$A22,\")\")","v":"20)"},{"$f":"(Working!$BM22)","v":"(c - 8)(c + 8) ="},{"$f":"CONCATENATE(Working!$A47,\")\")","v":"45)"},{"$f":"(Working!$BM47)","v":"(7c - 2)² ="},{"$f":"CONCATENATE(Working!$A72,\")\")","v":"70)"},{"$f":"(Working!$BM72)","v":"(8w - 5x)(8w + 5x) ="}]
[{"$f":"CONCATENATE(Working!$A23,\")\")","v":"21)"},{"$f":"(Working!$BM23)","v":"(f + 5)² ="},{"$f":"CONCATENATE(Working!$A48,\")\")","v":"46)"},{"$f":"(Working!$BM48)","v":"(8q + 7)(8q - 7) ="},{"$f":"CONCATENATE(Working!$A73,\")\")","v":"71)"},{"$f":"(Working!$BM73)","v":"(2h - 7m)(2h + 7m) ="}]
[{"$f":"CONCATENATE(Working!$A24,\")\")","v":"22)"},{"$f":"(Working!$BM24)","v":"(v + 2)(v + 3) ="},{"$f":"CONCATENATE(Working!$A49,\")\")","v":"47)"},{"$f":"(Working!$BM49)","v":"(9b + 2)(4b - 3) ="},{"$f":"CONCATENATE(Working!$A74,\")\")","v":"72)"},{"$f":"(Working!$BM74)","v":"(g + 7v)(7g - 5v) ="}]
[{"$f":"CONCATENATE(Working!$A25,\")\")","v":"23)"},{"$f":"(Working!$BM25)","v":"(d - 1)(d + 1) ="},{"$f":"CONCATENATE(Working!$A50,\")\")","v":"48)"},{"$f":"(Working!$BM50)","v":"(5u - 6)(5u + 6) ="},{"$f":"CONCATENATE(Working!$A75,\")\")","v":"73)"},{"$f":"(Working!$BM75)","v":"(b + 4k)² ="}]
[{"$f":"CONCATENATE(Working!$A26,\")\")","v":"24)"},{"$f":"(Working!$BM26)","v":"(p - 6)² ="},{"$f":"CONCATENATE(Working!$A51,\")\")","v":"49)"},{"$f":"(Working!$BM51)","v":"(2c - 3)(7c - 5) ="},{"$f":"CONCATENATE(Working!$A76,\")\")","v":"74)"},{"$f":"(Working!$BM76)","v":"(9r + w)² ="}]
[{"$f":"CONCATENATE(Working!$A27,\")\")","v":"25)"},{"$f":"(Working!$BM27)","v":"(k - 5)(k - 3) ="},{"$f":"CONCATENATE(Working!$A52,\")\")","v":"50)"},{"$f":"(Working!$BM52)","v":"(4q - 7)(4q + 7) ="},{"$f":"CONCATENATE(Working!$A77,\")\")","v":"75)"},{"$f":"(Working!$BM77)","v":"(5d - 6p)(2d + 7p) ="}]

{"sheet":"Answers","index":3,"n_rows":28,"n_cols":7,"rows_kept":28,"cut":false,"hidden":false,"merged":[]}
[null,null,null,"BINOMIAL EXPANSIONS"]
[null,null,null,"Answers",null,null,{"$f":"CONCATENATE(\"Worksheet \",Working!D1,Working!C1)","v":"Worksheet QT-568"}]
[]
[{"$f":"CONCATENATE(Working!$A3,\")\")","v":"1)"},{"$f":"Working!$BN3","v":"d² + 15d + 44"},{"$f":"CONCATENATE(Working!$A28,\")\")","v":"26)"},{"$f":"Working!$BN28","v":"16h² - 1"},{"$f":"CONCATENATE(Working!$A53,\")\")","v":"51)"},{"$f":"Working!$BN53","v":"9i² - 16v²"}]
[{"$f":"CONCATENATE(Working!$A4,\")\")","v":"2)"},{"$f":"Working!$BN4","v":"o² + 12o + 27"},{"$f":"CONCATENATE(Working!$A29,\")\")","v":"27)"},{"$f":"Working!$BN29","v":"81m² - 4"},{"$f":"CONCATENATE(Working!$A54,\")\")","v":"52)"},{"$f":"Working!$BN54","v":"64p² + 96pq + 35q²"}]
[{"$f":"CONCATENATE(Working!$A5,\")\")","v":"3)"},{"$f":"Working!$BN5","v":"k² - 16"},{"$f":"CONCATENATE(Working!$A30,\")\")","v":"28)"},{"$f":"Working!$BN30","v":"36h² - 73h - 18"},{"$f":"CONCATENATE(Working!$A55,\")\")","v":"53)"},{"$f":"Working!$BN55","v":"24t² + 70ta + 49a²"}]
[{"$f":"CONCATENATE(Working!$A6,\")\")","v":"4)"},{"$f":"Working!$BN6","v":"v² + 8v + 16"},{"$f":"CONCATENATE(Working!$A31,\")\")","v":"29)"},{"$f":"Working!$BN31","v":"49p² - 25"},{"$f":"CONCATENATE(Working!$A56,\")\")","v":"54)"},{"$f":"Working!$BN56","v":"j² - 36d²"}]
[{"$f":"CONCATENATE(Working!$A7,\")\")","v":"5)"},{"$f":"Working!$BN7","v":"b² + 6b + 9"},{"$f":"CONCATENATE(Working!$A32,\")\")","v":"30)"},{"$f":"Working!$BN32","v":"8w² - 2w - 45"},{"$f":"CONCATENATE(Working!$A57,\")\")","v":"55)"},{"$f":"Working!$BN57","v":"81o² - 16i²"}]
[{"$f":"CONCATENATE(Working!$A8,\")\")","v":"6)"},{"$f":"Working!$BN8","v":"j² + 16j + 64"},{"$f":"CONCATENATE(Working!$A33,\")\")","v":"31)"},{"$f":"Working!$BN33","v":"16d² - 1"},{"$f":"CONCATENATE(Working!$A58,\")\")","v":"56)"},{"$f":"Working!$BN58","v":"81g² - 16a²"}]
[{"$f":"CONCATENATE(Working!$A9,\")\")","v":"7)"},{"$f":"Working!$BN9","v":"m² + 18m + 81"},{"$f":"CONCATENATE(Working!$A34,\")\")","v":"32)"},{"$f":"Working!$BN34","v":"16t² + 8t + 1"},{"$f":"CONCATENATE(Working!$A59,\")\")","v":"57)"},{"$f":"Working!$BN59","v":"36o² + 84oc + 49c²"}]
[{"$f":"CONCATENATE(Working!$A10,\")\")","v":"8)"},{"$f":"Working!$BN10","v":"s² + 15s + 54"},{"$f":"CONCATENATE(Working!$A35,\")\")","v":"33)"},{"$f":"Working!$BN35","v":"64r² - 25"},{"$f":"CONCATENATE(Working!$A60,\")\")","v":"58)"},{"$f":"Working!$BN60","v":"81r² + 18rq + q²"}]
[{"$f":"CONCATENATE(Working!$A11,\")\")","v":"9)"},{"$f":"Working!$BN11","v":"c² + 6c + 8"},{"$f":"CONCATENATE(Working!$A36,\")\")","v":"34)"},{"$f":"Working!$BN36","v":"24j² + 83j + 63"},{"$f":"CONCATENATE(Working!$A61,\")\")","v":"59)"},{"$f":"Working!$BN61","v":"64n² - 49a²"}]
[{"$f":"CONCATENATE(Working!$A12,\")\")","v":"10)"},{"$f":"Working!$BN12","v":"c² - 144"},{"$f":"CONCATENATE(Working!$A37,\")\")","v":"35)"},{"$f":"Working!$BN37","v":"42x² - 37x - 14"},{"$f":"CONCATENATE(Working!$A62,\")\")","v":"60)"},{"$f":"Working!$BN62","v":"25f² + 60ft + 36t²"}]
[{"$f":"CONCATENATE(Working!$A13,\")\")","v":"11)"},{"$f":"Working!$BN13","v":"o² - 10o + 25"},{"$f":"CONCATENATE(Working!$A38,\")\")","v":"36)"},{"$f":"Working!$BN38","v":"4a² - 1"},{"$f":"CONCATENATE(Working!$A63,\")\")","v":"61)"},{"$f":"Working!$BN63","v":"25x² - 10xr + r²"}]
[{"$f":"CONCATENATE(Working!$A14,\")\")","v":"12)"},{"$f":"Working!$BN14","v":"o² - 1"},{"$f":"CONCATENATE(Working!$A39,\")\")","v":"37)"},{"$f":"Working!$BN39","v":"36e² - 49"},{"$f":"CONCATENATE(Working!$A64,\")\")","v":"62)"},{"$f":"Working!$BN64","v":"64c² - 49m²"}]
[{"$f":"CONCATENATE(Working!$A15,\")\")","v":"13)"},{"$f":"Working!$BN15","v":"g² - 20g + 99"},{"$f":"CONCATENATE(Working!$A40,\")\")","v":"38)"},{"$f":"Working!$BN40","v":"16o² - 25"},{"$f":"CONCATENATE(Working!$A65,\")\")","v":"63)"},{"$f":"Working!$BN65","v":"36o² + 60of + 25f²"}]
[{"$f":"CONCATENATE(Working!$A16,\")\")","v":"14)"},{"$f":"Working!$BN16","v":"o² - 49"},{"$f":"CONCATENATE(Working!$A41,\")\")","v":"39)"},{"$f":"Working!$BN41","v":"24s² + 50s + 25"},{"$f":"CONCATENATE(Working!$A66,\")\")","v":"64)"},{"$f":"Working!$BN66","v":"c² - 8cd + 16d²"}]
[{"$f":"CONCATENATE(Working!$A17,\")\")","v":"15)"},{"$f":"Working!$BN17","v":"b² - 24b + 144"},{"$f":"CONCATENATE(Working!$A42,\")\")","v":"40)"},{"$f":"Working!$BN42","v":"49i² - 1"},{"$f":"CONCATENATE(Working!$A67,\")\")","v":"65)"},{"$f":"Working!$BN67","v":"4g² + 20gq + 25q²"}]
[{"$f":"CONCATENATE(Working!$A18,\")\")","v":"16)"},{"$f":"Working!$BN18","v":"h² - 11h + 24"},{"$f":"CONCATENATE(Working!$A43,\")\")","v":"41)"},{"$f":"Working!$BN43","v":"49v² - 36"},{"$f":"CONCATENATE(Working!$A68,\")\")","v":"66)"},{"$f":"Working!$BN68","v":"16x² - 25o²"}]
[{"$f":"CONCATENATE(Working!$A19,\")\")","v":"17)"},{"$f":"Working!$BN19","v":"f² - 13f + 12"},{"$f":"CONCATENATE(Working!$A44,\")\")","v":"42)"},{"$f":"Working!$BN44","v":"24e² + 86e + 77"},{"$f":"CONCATENATE(Working!$A69,\")\")","v":"67)"},{"$f":"Working!$BN69","v":"16i² + 24ik + 9k²"}]
[{"$f":"CONCATENATE(Working!$A20,\")\")","v":"18)"},{"$f":"Working!$BN20","v":"p² - 9"},{"$f":"CONCATENATE(Working!$A45,\")\")","v":"43)"},{"$f":"Working!$BN45","v":"27v² + 48v + 16"},{"$f":"CONCATENATE(Working!$A70,\")\")","v":"68)"},{"$f":"Working!$BN70","v":"3m² - 11ma + 6a²"}]
[{"$f":"CONCATENATE(Working!$A21,\")\")","v":"19)"},{"$f":"Working!$BN21","v":"i² - 11i + 30"},{"$f":"CONCATENATE(Working!$A46,\")\")","v":"44)"},{"$f":"Working!$BN46","v":"25p² - 40p + 16"},{"$f":"CONCATENATE(Working!$A71,\")\")","v":"69)"},{"$f":"Working!$BN71","v":"6u² - 31uj + 28j²"}]
[{"$f":"CONCATENATE(Working!$A22,\")\")","v":"20)"},{"$f":"Working!$BN22","v":"c² - 64"},{"$f":"CONCATENATE(Working!$A47,\")\")","v":"45)"},{"$f":"Working!$BN47","v":"49c² - 28c + 4"},{"$f":"CONCATENATE(Working!$A72,\")\")","v":"70)"},{"$f":"Working!$BN72","v":"64w² - 25x²"}]
[{"$f":"CONCATENATE(Working!$A23,\")\")","v":"21)"},{"$f":"Working!$BN23","v":"f² + 10f + 25"},{"$f":"CONCATENATE(Working!$A48,\")\")","v":"46)"},{"$f":"Working!$BN48","v":"64q² - 49"},{"$f":"CONCATENATE(Working!$A73,\")\")","v":"71)"},{"$f":"Working!$BN73","v":"4h² - 49m²"}]
[{"$f":"CONCATENATE(Working!$A24,\")\")","v":"22)"},{"$f":"Working!$BN24","v":"v² + 5v + 6"},{"$f":"CONCATENATE(Working!$A49,\")\")","v":"47)"},{"$f":"Working!$BN49","v":"36b² - 19b - 6"},{"$f":"CONCATENATE(Working!$A74,\")\")","v":"72)"},{"$f":"Working!$BN74","v":"7g² + 44gv - 35v²"}]
[{"$f":"CONCATENATE(Working!$A25,\")\")","v":"23)"},{"$f":"Working!$BN25","v":"d² - 1"},{"$f":"CONCATENATE(Working!$A50,\")\")","v":"48)"},{"$f":"Working!$BN50","v":"25u² - 36"},{"$f":"CONCATENATE(Working!$A75,\")\")","v":"73)"},{"$f":"Working!$BN75","v":"b² + 8bk + 16k²"}]
[{"$f":"CONCATENATE(Working!$A26,\")\")","v":"24)"},{"$f":"Working!$BN26","v":"p² - 12p + 36"},{"$f":"CONCATENATE(Working!$A51,\")\")","v":"49)"},{"$f":"Working!$BN51","v":"14c² - 31c + 15"},{"$f":"CONCATENATE(Working!$A76,\")\")","v":"74)"},{"$f":"Working!$BN76","v":"81r² + 18rw + w²"}]
[{"$f":"CONCATENATE(Working!$A27,\")\")","v":"25)"},{"$f":"Working!$BN27","v":"k² - 8k + 15"},{"$f":"CONCATENATE(Working!$A52,\")\")","v":"50)"},{"$f":"Working!$BN52","v":"16q² - 49"},{"$f":"CONCATENATE(Working!$A77,\")\")","v":"75)"},{"$f":"Working!$BN77","v":"10d² + 23dp - 42p²"}]