{"text_format":"1","workbook":"xlsx","n_sheets":3,"sheets":["Worksheet","Answers","Working"],"not_rendered":{"charts":0,"images":0,"macros":1,"external_links":0,"defined_names":0,"comments":0,"pivot_tables":0},"unopened":[],"bounds":{"document_bytes":16777216,"sheet_cells":100000,"rows_first":2000,"rows_last":500,"rows_between":2000,"halvings":0,"cell_chars":16384,"cell_head_chars":4096},"cells_cut":0,"cells_raw":0,"read":"whole","date_system":"1900"}

{"sheet":"Worksheet","index":0,"n_rows":28,"n_cols":6,"rows_kept":28,"cut":false,"hidden":false,"merged":[]}
[null,null,null,"COLLECT LIKE TERMS"]
[null,null,null,null,{"$f":"CONCATENATE(\"Worksheet \",Working!C1,Working!B1)","v":"Worksheet CUT-321"}]
["Simplify the following;"]
[{"$f":"CONCATENATE(Working!A2,\")\")","v":"1)"},{"$f":"Working!BN2","v":"o - 6z - 4z - 8o ="},{"$f":"CONCATENATE(Working!A27,\")\")","v":"26)"},{"$f":"Working!BN27","v":"-6w + 3g + 3g + 5w ="},{"$f":"CONCATENATE(Working!A52,\")\")","v":"51)"},{"$f":"Working!BN52","v":"-9n + 4f + 9f + 2n ="}]
[{"$f":"CONCATENATE(Working!A3,\")\")","v":"2)"},{"$f":"Working!BN3","v":"2i + 5x - 9i + 4x ="},{"$f":"CONCATENATE(Working!A28,\")\")","v":"27)"},{"$f":"Working!BN28","v":"-6b + 4i - 5b + 9i ="},{"$f":"CONCATENATE(Working!A53,\")\")","v":"52)"},{"$f":"Working!BN53","v":"7j + 2x - 4x + 7j ="}]
[{"$f":"CONCATENATE(Working!A4,\")\")","v":"3)"},{"$f":"Working!BN4","v":"-2y + 2k - 5y - 8k ="},{"$f":"CONCATENATE(Working!A29,\")\")","v":"28)"},{"$f":"Working!BN29","v":"-7b + 9y - 2y + 6y ="},{"$f":"CONCATENATE(Working!A54,\")\")","v":"53)"},{"$f":"Working!BN54","v":"-6s - 2n - 2n - 8n ="}]
[{"$f":"CONCATENATE(Working!A5,\")\")","v":"4)"},{"$f":"Working!BN5","v":"-6u - u - 8u - 7g ="},{"$f":"CONCATENATE(Working!A30,\")\")","v":"29)"},{"$f":"Working!BN30","v":"4t + 6z - 8z + 6t ="},{"$f":"CONCATENATE(Working!A55,\")\")","v":"54)"},{"$f":"Working!BN55","v":"6i + 7n - 8n - i ="}]
[{"$f":"CONCATENATE(Working!A6,\")\")","v":"5)"},{"$f":"Working!BN6","v":"8q - 2f + 2q - 4f ="},{"$f":"CONCATENATE(Working!A31,\")\")","v":"30)"},{"$f":"Working!BN31","v":"5n + 7x - x - 2x ="},{"$f":"CONCATENATE(Working!A56,\")\")","v":"55)"},{"$f":"Working!BN56","v":"-4v - 4v + 8v - 3a ="}]
[{"$f":"CONCATENATE(Working!A7,\")\")","v":"6)"},{"$f":"Working!BN7","v":"-4g + 7j - 3j + 2g ="},{"$f":"CONCATENATE(Working!A32,\")\")","v":"31)"},{"$f":"Working!BN32","v":"o - 7g + 7g + 4g ="},{"$f":"CONCATENATE(Working!A57,\")\")","v":"56)"},{"$f":"Working!BN57","v":"-3m - 4v - 4v + 8m ="}]
[{"$f":"CONCATENATE(Working!A8,\")\")","v":"7)"},{"$f":"Working!BN8","v":"-3d - 8d - d - 3i ="},{"$f":"CONCATENATE(Working!A33,\")\")","v":"32)"},{"$f":"Working!BN33","v":"-2e - 2e - 9e - 7u ="},{"$f":"CONCATENATE(Working!A58,\")\")","v":"57)"},{"$f":"Working!BN58","v":"-8p - 3m + 7m - m ="}]
[{"$f":"CONCATENATE(Working!A9,\")\")","v":"8)"},{"$f":"Working!BN9","v":"2c + 9g + 9g - 9g ="},{"$f":"CONCATENATE(Working!A34,\")\")","v":"33)"},{"$f":"Working!BN34","v":"3k + 4x - 7k - 6x ="},{"$f":"CONCATENATE(Working!A59,\")\")","v":"58)"},{"$f":"Working!BN59","v":"5z + u - 3u - 9z ="}]
[{"$f":"CONCATENATE(Working!A10,\")\")","v":"9)"},{"$f":"Working!BN10","v":"5z + 9c + 6c - 2c ="},{"$f":"CONCATENATE(Working!A35,\")\")","v":"34)"},{"$f":"Working!BN35","v":"-4b - 5f - 6f + 8b ="},{"$f":"CONCATENATE(Working!A60,\")\")","v":"59)"},{"$f":"Working!BN60","v":"-i + 7d + i + 5d ="}]
[{"$f":"CONCATENATE(Working!A11,\")\")","v":"10)"},{"$f":"Working!BN11","v":"-8t - 9t + 4t - 8t ="},{"$f":"CONCATENATE(Working!A36,\")\")","v":"35)"},{"$f":"Working!BN36","v":"-m + 2m + 2m + 4v ="},{"$f":"CONCATENATE(Working!A61,\")\")","v":"60)"},{"$f":"Working!BN61","v":"3g + 8p - 5p - 2p ="}]
[{"$f":"CONCATENATE(Working!A12,\")\")","v":"11)"},{"$f":"Working!BN12","v":"-z + 4q + 3q - 5q ="},{"$f":"CONCATENATE(Working!A37,\")\")","v":"36)"},{"$f":"Working!BN37","v":"-4c + 2c + c - 3f ="},{"$f":"CONCATENATE(Working!A62,\")\")","v":"61)"},{"$f":"Working!BN62","v":"-9t - 7p - 3p - 4p ="}]
[{"$f":"CONCATENATE(Working!A13,\")\")","v":"12)"},{"$f":"Working!BN13","v":"2n - 5r + 5r + 8n ="},{"$f":"CONCATENATE(Working!A38,\")\")","v":"37)"},{"$f":"Working!BN38","v":"5x + 5d + x - 8d ="},{"$f":"CONCATENATE(Working!A63,\")\")","v":"62)"},{"$f":"Working!BN63","v":"-5v - 5v + 6v - 8i ="}]
[{"$f":"CONCATENATE(Working!A14,\")\")","v":"13)"},{"$f":"Working!BN14","v":"-4b - 7w - 3w + 5b ="},{"$f":"CONCATENATE(Working!A39,\")\")","v":"38)"},{"$f":"Working!BN39","v":"6h + 7h - 2h + 8p ="},{"$f":"CONCATENATE(Working!A64,\")\")","v":"63)"},{"$f":"Working!BN64","v":"4v - 5d - 7d + 2d ="}]
[{"$f":"CONCATENATE(Working!A15,\")\")","v":"14)"},{"$f":"Working!BN15","v":"7v + 4s + 9v + 6s ="},{"$f":"CONCATENATE(Working!A40,\")\")","v":"39)"},{"$f":"Working!BN40","v":"6g - 3g + 8g + 9u ="},{"$f":"CONCATENATE(Working!A65,\")\")","v":"64)"},{"$f":"Working!BN65","v":"-3q + 5m + 2m + 8m ="}]
[{"$f":"CONCATENATE(Working!A16,\")\")","v":"15)"},{"$f":"Working!BN16","v":"-3o - 9f + 6f + o ="},{"$f":"CONCATENATE(Working!A41,\")\")","v":"40)"},{"$f":"Working!BN41","v":"-5g - 4n + 8n + 8g ="},{"$f":"CONCATENATE(Working!A66,\")\")","v":"65)"},{"$f":"Working!BN66","v":"-4h - 3f + 9f - 9h ="}]
[{"$f":"CONCATENATE(Working!A17,\")\")","v":"16)"},{"$f":"Working!BN17","v":"5g + 6r - 7g + 9r ="},{"$f":"CONCATENATE(Working!A42,\")\")","v":"41)"},{"$f":"Working!BN42","v":"-2o - 8q + 9q + 4o ="},{"$f":"CONCATENATE(Working!A67,\")\")","v":"66)"},{"$f":"Working!BN67","v":"-2f + 4m - 6m - 6f ="}]
[{"$f":"CONCATENATE(Working!A18,\")\")","v":"17)"},{"$f":"Working!BN18","v":"8p + 3p - 3p - 4b ="},{"$f":"CONCATENATE(Working!A43,\")\")","v":"42)"},{"$f":"Working!BN43","v":"-e + 5n + n - 4e ="},{"$f":"CONCATENATE(Working!A68,\")\")","v":"67)"},{"$f":"Working!BN68","v":"-8c - 4t - 7t + 7c ="}]
[{"$f":"CONCATENATE(Working!A19,\")\")","v":"18)"},{"$f":"Working!BN19","v":"w - w + 3w - 6v ="},{"$f":"CONCATENATE(Working!A44,\")\")","v":"43)"},{"$f":"Working!BN44","v":"-4f + 7r - 5r + 8f ="},{"$f":"CONCATENATE(Working!A69,\")\")","v":"68)"},{"$f":"Working!BN69","v":"2w - 9h - 5h - h ="}]
[{"$f":"CONCATENATE(Working!A20,\")\")","v":"19)"},{"$f":"Working!BN20","v":"-4a - 8a + 7a + 3j ="},{"$f":"CONCATENATE(Working!A45,\")\")","v":"44)"},{"$f":"Working!BN45","v":"-5a + 6d - 4d + 7a ="},{"$f":"CONCATENATE(Working!A70,\")\")","v":"69)"},{"$f":"Working!BN70","v":"7v - 5v + 5v - 4n ="}]
[{"$f":"CONCATENATE(Working!A21,\")\")","v":"20)"},{"$f":"Working!BN21","v":"9y + 7d + y + 4d ="},{"$f":"CONCATENATE(Working!A46,\")\")","v":"45)"},{"$f":"Working!BN46","v":"3f - 8f + f + 7w ="},{"$f":"CONCATENATE(Working!A71,\")\")","v":"70)"},{"$f":"Working!BN71","v":"9j - 4a - 4a - 2j ="}]
[{"$f":"CONCATENATE(Working!A22,\")\")","v":"21)"},{"$f":"Working!BN22","v":"-8g + 7e + 7e - 2g ="},{"$f":"CONCATENATE(Working!A47,\")\")","v":"46)"},{"$f":"Working!BN47","v":"4b + b + 2b - 3z ="},{"$f":"CONCATENATE(Working!A72,\")\")","v":"71)"},{"$f":"Working!BN72","v":"-5z - 6h - 3z - 2h ="}]
[{"$f":"CONCATENATE(Working!A23,\")\")","v":"22)"},{"$f":"Working!BN23","v":"-8e - 9e + 9e + 5f ="},{"$f":"CONCATENATE(Working!A48,\")\")","v":"47)"},{"$f":"Working!BN48","v":"o + 2o + 2o - 5n ="},{"$f":"CONCATENATE(Working!A73,\")\")","v":"72)"},{"$f":"Working!BN73","v":"-7t - 5i - 6t + 3i ="}]
[{"$f":"CONCATENATE(Working!A24,\")\")","v":"23)"},{"$f":"Working!BN24","v":"9n + 2v + 6n + 6v ="},{"$f":"CONCATENATE(Working!A49,\")\")","v":"48)"},{"$f":"Working!BN49","v":"7c + c + 2c - 3b ="},{"$f":"CONCATENATE(Working!A74,\")\")","v":"73)"},{"$f":"Working!BN74","v":"-t - 2a + 9a + 7t ="}]
[{"$f":"CONCATENATE(Working!A25,\")\")","v":"24)"},{"$f":"Working!BN25","v":"-7f + n - 4n + 9f ="},{"$f":"CONCATENATE(Working!A50,\")\")","v":"49)"},{"$f":"Working!BN50","v":"-2e - 5r - 9e - 2r ="},{"$f":"CONCATENATE(Working!A75,\")\")","v":"74)"},{"$f":"Working!BN75","v":"7c + 3s + 9s + 3s ="}]
[{"$f":"CONCATENATE(Working!A26,\")\")","v":"25)"},{"$f":"Working!BN26","v":"5m + 5m - 7m - 4n ="},{"$f":"CONCATENATE(Working!A51,\")\")","v":"50)"},{"$f":"Working!BN51","v":"7x - 5x + 8x - 3j ="},{"$f":"CONCATENATE(Working!A76,\")\")","v":"75)"},{"$f":"Working!BN76","v":"-2a + 4a + 6a - 3m ="}]

{"sheet":"Answers","index":1,"n_rows":28,"n_cols":6,"rows_kept":28,"cut":false,"hidden":false,"merged":[]}
[null,null,null,"COLLECT LIKE TERMS"]
[null,null,null,"ANSWERS",{"$f":"CONCATENATE(\"Worksheet \",Working!C1,Working!B1)","v":"Worksheet CUT-321"}]
[]
[{"$f":"CONCATENATE(Working!A2,\")\")","v":"1)"},{"$f":"Working!BO2","v":"-7o - 10z"},{"$f":"CONCATENATE(Working!A27,\")\")","v":"26)"},{"$f":"Working!BO27","v":"-w + 6g"},{"$f":"CONCATENATE(Working!A52,\")\")","v":"51)"},{"$f":"Working!BO52","v":"-7n + 13f"}]
[{"$f":"CONCATENATE(Working!A3,\")\")","v":"2)"},{"$f":"Working!BO3","v":"-7i + 9x"},{"$f":"CONCATENATE(Working!A28,\")\")","v":"27)"},{"$f":"Working!BO28","v":"-11b + 13i"},{"$f":"CONCATENATE(Working!A53,\")\")","v":"52)"},{"$f":"Working!BO53","v":"14j - 2x"}]
[{"$f":"CONCATENATE(Working!A4,\")\")","v":"3)"},{"$f":"Working!BO4","v":"-7y - 6k"},{"$f":"CONCATENATE(Working!A29,\")\")","v":"28)"},{"$f":"Working!BO29","v":"-7b + 13y"},{"$f":"CONCATENATE(Working!A54,\")\")","v":"53)"},{"$f":"Working!BO54","v":"-6s - 12n"}]
[{"$f":"CONCATENATE(Working!A5,\")\")","v":"4)"},{"$f":"Working!BO5","v":"-15u - 7g"},{"$f":"CONCATENATE(Working!A30,\")\")","v":"29)"},{"$f":"Working!BO30","v":"10t - 2z"},{"$f":"CONCATENATE(Working!A55,\")\")","v":"54)"},{"$f":"Working!BO55","v":"5i - n"}]
[{"$f":"CONCATENATE(Working!A6,\")\")","v":"5)"},{"$f":"Working!BO6","v":"10q - 6f"},{"$f":"CONCATENATE(Working!A31,\")\")","v":"30)"},{"$f":"Working!BO31","v":"5n + 4x"},{"$f":"CONCATENATE(Working!A56,\")\")","v":"55)"},{"$f":"Working!BO56","v":" - 3a"}]
[{"$f":"CONCATENATE(Working!A7,\")\")","v":"6)"},{"$f":"Working!BO7","v":"-2g + 4j"},{"$f":"CONCATENATE(Working!A32,\")\")","v":"31)"},{"$f":"Working!BO32","v":"o + 4g"},{"$f":"CONCATENATE(Working!A57,\")\")","v":"56)"},{"$f":"Working!BO57","v":"5m - 8v"}]
[{"$f":"CONCATENATE(Working!A8,\")\")","v":"7)"},{"$f":"Working!BO8","v":"-12d - 3i"},{"$f":"CONCATENATE(Working!A33,\")\")","v":"32)"},{"$f":"Working!BO33","v":"-13e - 7u"},{"$f":"CONCATENATE(Working!A58,\")\")","v":"57)"},{"$f":"Working!BO58","v":"-8p + 3m"}]
[{"$f":"CONCATENATE(Working!A9,\")\")","v":"8)"},{"$f":"Working!BO9","v":"2c + 9g"},{"$f":"CONCATENATE(Working!A34,\")\")","v":"33)"},{"$f":"Working!BO34","v":"-4k - 2x"},{"$f":"CONCATENATE(Working!A59,\")\")","v":"58)"},{"$f":"Working!BO59","v":"-4z - 2u"}]
[{"$f":"CONCATENATE(Working!A10,\")\")","v":"9)"},{"$f":"Working!BO10","v":"5z + 13c"},{"$f":"CONCATENATE(Working!A35,\")\")","v":"34)"},{"$f":"Working!BO35","v":"4b - 11f"},{"$f":"CONCATENATE(Working!A60,\")\")","v":"59)"},{"$f":"Working!BO60","v":"12d"}]
[{"$f":"CONCATENATE(Working!A11,\")\")","v":"10)"},{"$f":"Working!BO11","v":"-13t - 8t"},{"$f":"CONCATENATE(Working!A36,\")\")","v":"35)"},{"$f":"Working!BO36","v":"3m + 4v"},{"$f":"CONCATENATE(Working!A61,\")\")","v":"60)"},{"$f":"Working!BO61","v":"3g + p"}]
[{"$f":"CONCATENATE(Working!A12,\")\")","v":"11)"},{"$f":"Working!BO12","v":"-z + 2q"},{"$f":"CONCATENATE(Working!A37,\")\")","v":"36)"},{"$f":"Working!BO37","v":"-c - 3f"},{"$f":"CONCATENATE(Working!A62,\")\")","v":"61)"},{"$f":"Working!BO62","v":"-9t - 14p"}]
[{"$f":"CONCATENATE(Working!A13,\")\")","v":"12)"},{"$f":"Working!BO13","v":"10n"},{"$f":"CONCATENATE(Working!A38,\")\")","v":"37)"},{"$f":"Working!BO38","v":"6x - 3d"},{"$f":"CONCATENATE(Working!A63,\")\")","v":"62)"},{"$f":"Working!BO63","v":"-4v - 8i"}]
[{"$f":"CONCATENATE(Working!A14,\")\")","v":"13)"},{"$f":"Working!BO14","v":"b - 10w"},{"$f":"CONCATENATE(Working!A39,\")\")","v":"38)"},{"$f":"Working!BO39","v":"11h + 8p"},{"$f":"CONCATENATE(Working!A64,\")\")","v":"63)"},{"$f":"Working!BO64","v":"4v - 10d"}]
[{"$f":"CONCATENATE(Working!A15,\")\")","v":"14)"},{"$f":"Working!BO15","v":"16v + 10s"},{"$f":"CONCATENATE(Working!A40,\")\")","v":"39)"},{"$f":"Working!BO40","v":"11g + 9u"},{"$f":"CONCATENATE(Working!A65,\")\")","v":"64)"},{"$f":"Working!BO65","v":"-3q + 15m"}]
[{"$f":"CONCATENATE(Working!A16,\")\")","v":"15)"},{"$f":"Working!BO16","v":"-2o - 3f"},{"$f":"CONCATENATE(Working!A41,\")\")","v":"40)"},{"$f":"Working!BO41","v":"3g + 4n"},{"$f":"CONCATENATE(Working!A66,\")\")","v":"65)"},{"$f":"Working!BO66","v":"-13h + 6f"}]
[{"$f":"CONCATENATE(Working!A17,\")\")","v":"16)"},{"$f":"Working!BO17","v":"-2g + 15r"},{"$f":"CONCATENATE(Working!A42,\")\")","v":"41)"},{"$f":"Working!BO42","v":"2o + q"},{"$f":"CONCATENATE(Working!A67,\")\")","v":"66)"},{"$f":"Working!BO67","v":"-8f - 2m"}]
[{"$f":"CONCATENATE(Working!A18,\")\")","v":"17)"},{"$f":"Working!BO18","v":"8p - 4b"},{"$f":"CONCATENATE(Working!A43,\")\")","v":"42)"},{"$f":"Working!BO43","v":"-5e + 6n"},{"$f":"CONCATENATE(Working!A68,\")\")","v":"67)"},{"$f":"Working!BO68","v":"-c - 11t"}]
[{"$f":"CONCATENATE(Working!A19,\")\")","v":"18)"},{"$f":"Working!BO19","v":"3w - 6v"},{"$f":"CONCATENATE(Working!A44,\")\")","v":"43)"},{"$f":"Working!BO44","v":"4f + 2r"},{"$f":"CONCATENATE(Working!A69,\")\")","v":"68)"},{"$f":"Working!BO69","v":"2w - 15h"}]
[{"$f":"CONCATENATE(Working!A20,\")\")","v":"19)"},{"$f":"Working!BO20","v":"-5a + 3j"},{"$f":"CONCATENATE(Working!A45,\")\")","v":"44)"},{"$f":"Working!BO45","v":"2a + 2d"},{"$f":"CONCATENATE(Working!A70,\")\")","v":"69)"},{"$f":"Working!BO70","v":"7v - 4n"}]
[{"$f":"CONCATENATE(Working!A21,\")\")","v":"20)"},{"$f":"Working!BO21","v":"10y + 11d"},{"$f":"CONCATENATE(Working!A46,\")\")","v":"45)"},{"$f":"Working!BO46","v":"-4f + 7w"},{"$f":"CONCATENATE(Working!A71,\")\")","v":"70)"},{"$f":"Working!BO71","v":"7j - 8a"}]
[{"$f":"CONCATENATE(Working!A22,\")\")","v":"21)"},{"$f":"Working!BO22","v":"-10g + 14e"},{"$f":"CONCATENATE(Working!A47,\")\")","v":"46)"},{"$f":"Working!BO47","v":"7b - 3z"},{"$f":"CONCATENATE(Working!A72,\")\")","v":"71)"},{"$f":"Working!BO72","v":"-8z - 8h"}]
[{"$f":"CONCATENATE(Working!A23,\")\")","v":"22)"},{"$f":"Working!BO23","v":"-8e + 5f"},{"$f":"CONCATENATE(Working!A48,\")\")","v":"47)"},{"$f":"Working!BO48","v":"5o - 5n"},{"$f":"CONCATENATE(Working!A73,\")\")","v":"72)"},{"$f":"Working!BO73","v":"-13t - 2i"}]
[{"$f":"CONCATENATE(Working!A24,\")\")","v":"23)"},{"$f":"Working!BO24","v":"15n + 8v"},{"$f":"CONCATENATE(Working!A49,\")\")","v":"48)"},{"$f":"Working!BO49","v":"10c - 3b"},{"$f":"CONCATENATE(Working!A74,\")\")","v":"73)"},{"$f":"Working!BO74","v":"6t + 7a"}]
[{"$f":"CONCATENATE(Working!A25,\")\")","v":"24)"},{"$f":"Working!BO25","v":"2f - 3n"},{"$f":"CONCATENATE(Working!A50,\")\")","v":"49)"},{"$f":"Working!BO50","v":"-11e - 7r"},{"$f":"CONCATENATE(Working!A75,\")\")","v":"74)"},{"$f":"Working!BO75","v":"7c + 15s"}]
[{"$f":"CONCATENATE(Working!A26,\")\")","v":"25)"},{"$f":"Working!BO26","v":"3m - 4n"},{"$f":"CONCATENATE(Working!A51,\")\")","v":"50)"},{"$f":"Working!BO51","v":"10x - 3j"},{"$f":"CONCATENATE(Working!A76,\")\")","v":"75)"},{"$f":"Working!BO76","v":"8a - 3m"}]

{"sheet":"Working","index":2,"n_rows":76,"n_cols":67,"rows_kept":76,"cut":false,"hidden":true,"merged":[]}
[{"$f":"INT(900*RAND()+100)","v":320},{"$f":"TEXT(1,A1)","v":"321"},"CUT-"]
[1,{"$f":"INT(26*RAND()+97)","v":111},{"$f":"IF(B2=108,CHAR(B2+1),CHAR(B2))","v":"o"},{"$f":"INT(26*RAND()+97)","v":122},{"$f":"IF(D2=108,CHAR(D2+1),CHAR(D2))","v":"z"},{"$f":"INT(9*RAND()+1)","v":1},{"$f":"INT(2*RAND())","v":0},{"$f":"IF(G2=0,\"\",\"-\")","v":""},{"$f":"IF(F2=1,\"\",TEXT(F2,F2))","v":""},{"$f":"INT(9*RAND()+1)","v":6},{"$f":"INT(2*RAND())","v":1},{"$f":"IF(K2=0,\" + \",\" - \")","v":" - "},{"$f":"IF(J2=1,\"\",TEXT(J2,J2))","v":"6"},{"$f":"INT(9*RAND()+1)","v":4},{"$f":"INT(2*RAND())","v":1},{"$f":"IF(N2=0,\"\",IF(O2=0,\" + \",\" - \"))","v":" - "},{"$f":"IF(N2=0,\"\",IF(N2=1,\"\",TEXT(N2,N2)))","v":"4"},null,{"$f":"INT(9*RAND()+1)","v":8},{"$f":"INT(2*RAND())","v":1},{"$f":"IF(S2=0,\"\",IF(T2=0,\" + \",\" - \"))","v":" - "},{"$f":"IF(S2=0,\"\",IF(S2=1,\"\",TEXT(S2,0)))","v":"8"},null,{"$f":"10*INT(4*RAND())","v":30},null,{"$f":"CONCATENATE($H2,$I2,$C2,$L2,$M2,$E2,$P2,$Q2,$C2,$U2,$V2,$E2,\" =\")","v":"o - 6z - 4o - 8z ="},{"$f":"((-1)^$G2*$F2+(-1)^$O2*$N2)","v":-3},{"$f":"IF(AA2=0,\"\",IF(AA2=1,\"\",IF(AA2=-1,\"-\",TEXT(AA2,0))))","v":"-3"},{"$f":"IF(AA2=0,\"\",CONCATENATE(AB2,$C2))","v":"-3o"},{"$f":"((-1)^$K2*$J2+(-1)^$T2*$S2)","v":-14},{"$f":"IF(AD2=0,\"\",IF(AD2<0,\" - \",IF(AA2=0,\"\",\" + \")))","v":" - "},{"$f":"IF(AD2=0,\"\",IF(AD2=1,\"\",IF(AD2=-1,\"\",TEXT(ABS(AD2),0))))","v":"14"},{"$f":"IF(AD2=0,\"\",CONCATENATE(AF2,$E2))","v":"14z"},{"$f":"IF(AD2=0,AC2,CONCATENATE(AC2,AE2,AG2))","v":"-3o - 14z"},null,{"$f":"CONCATENATE($H2,$I2,$C2,$L2,$M2,$C2,$P2,$Q2,$C2,$U2,$V2,$E2,\" =\")","v":"o - 6o - 4o - 8z ="},{"$f":"((-1)^$G2*$F2+(-1)^$K2*$J2+(-1)^$O2*$N2)","v":-9},{"$f":"IF(AK2=0,\"\",IF(AK2=1,\"\",IF(AK2=-1,\"-\",TEXT(AK2,0))))","v":"-9"},{"$f":"IF(AK2=0,\"\",CONCATENATE(AL2,$C2))","v":"-9o"},{"$f":"((-1)^$T2*$S2)","v":-8},{"$f":"IF(AN2=0,\"\",IF(AN2<0,\" - \",IF(AK2=0,\"\",\" + \")))","v":" - "},{"$f":"IF(AN2=0,\"\",IF(AN2=1,\"\",IF(AN2=-1,\"\",TEXT(ABS(AN2),0))))","v":"8"},{"$f":"IF(AN2=0,\"\",CONCATENATE(AP2,$E2))","v":"8z"},{"$f":"IF(AN2=0,AM2,CONCATENATE(AM2,AO2,AQ2))","v":"-9o - 8z"},null,{"$f":"CONCATENATE($H2,$I2,$C2,$L2,$M2,$E2,$P2,$Q2,$E2,$U2,$V2,$E2,\" =\")","v":"o - 6z - 4z - 8z ="},{"$f":"((-1)^$G2*$F2)","v":1},{"$f":"IF(AU2=0,\"\",IF(AU2=1,\"\",IF(AU2=-1,\"-\",TEXT(AU2,0))))","v":""},{"$f":"IF(AU2=0,\"\",CONCATENATE(AV2,$C2))","v":"o"},{"$f":"((-1)^$K2*$J2+(-1)^$O2*$N2+((-1)^$T2*$S2))","v":-18},{"$f":"IF(AX2=0,\"\",IF(AX2<0,\" - \",IF(AU2=0,\"\",\" + \")))","v":" - "},{"$f":"IF(AX2=0,\"\",IF(AX2=1,\"\",IF(AX2=-1,\"\",TEXT(ABS(AX2),0))))","v":"18"},{"$f":"IF(AX2=0,\"\",CONCATENATE(AZ2,$E2))","v":"18z"},{"$f":"IF(AX2=0,AW2,CONCATENATE(AW2,AY2,BA2))","v":"o - 18z"},null,{"$f":"CONCATENATE($H2,$I2,$C2,$L2,$M2,$E2,$P2,$Q2,$E2,$U2,$V2,$C2,\" =\")","v":"o - 6z - 4z - 8o ="},{"$f":"((-1)^$G2*$F2+(-1)^$T2*$S2)","v":-7},{"$f":"IF(BE2=0,\"\",IF(BE2=1,\"\",IF(BE2=-1,\"-\",TEXT(BE2,0))))","v":"-7"},{"$f":"IF(BE2=0,\"\",CONCATENATE(BF2,$C2))","v":"-7o"},{"$f":"((-1)^$O2*$N2+(-1)^$K2*$J2)","v":-10},{"$f":"IF(BH2=0,\"\",IF(BH2<0,\" - \",IF(BE2=0,\"\",\" + \")))","v":" - "},{"$f":"IF(BH2=0,\"\",IF(BH2=1,\"\",IF(BH2=-1,\"\",TEXT(ABS(BH2),0))))","v":"10"},{"$f":"IF(BH2=0,\"\",CONCATENATE(BJ2,$E2))","v":"10z"},{"$f":"IF(BH2=0,BG2,CONCATENATE(BG2,BI2,BK2))","v":"-7o - 10z"},null,{"$f":"OFFSET(Z2,0,VALUE(X2))","v":"o - 6z - 4z - 8o ="},{"$f":"OFFSET(AH2,0,VALUE(X2))","v":"-7o - 10z"}]
[2,{"$f":"INT(26*RAND()+97)","v":105},{"$f":"IF(B3=108,CHAR(B3+1),CHAR(B3))","v":"i"},{"$f":"INT(26*RAND()+97)","v":120},{"$f":"IF(D3=108,CHAR(D3+1),CHAR(D3))","v":"x"},{"$f":"INT(9*RAND()+1)","v":2},{"$f":"INT(2*RAND())","v":0},{"$f":"IF(G3=0,\"\",\"-\")","v":""},{"$f":"IF(F3=1,\"\",TEXT(F3,F3))","v":"2"},{"$f":"INT(9*RAND()+1)","v":5},{"$f":"INT(2*RAND())","v":0},{"$f":"IF(K3=0,\" + \",\" - \")","v":" + "},{"$f":"IF(J3=1,\"\",TEXT(J3,J3))","v":"5"},{"$f":"INT(9*RAND()+1)","v":9},{"$f":"INT(2*RAND())","v":1},{"$f":"IF(N3=0,\"\",IF(O3=0,\" + \",\" - \"))","v":" - "},{"$f":"IF(N3=0,\"\",IF(N3=1,\"\",TEXT(N3,N3)))","v":"9"},null,{"$f":"INT(9*RAND()+1)","v":4},{"$f":"INT(2*RAND())","v":0},{"$f":"IF(S3=0,\"\",IF(T3=0,\" + \",\" - \"))","v":" + "},{"$f":"IF(S3=0,\"\",IF(S3=1,\"\",TEXT(S3,0)))","v":"4"},null,{"$f":"10*INT(4*RAND())","v":0},null,{"$f":"CONCATENATE($H3,$I3,$C3,$L3,$M3,$E3,$P3,$Q3,$C3,$U3,$V3,$E3,\" =\")","v":"2i + 5x - 9i + 4x ="},{"$f":"((-1)^$G3*$F3+(-1)^$O3*$N3)","v":-7},{"$f":"IF(AA3=0,\"\",IF(AA3=1,\"\",IF(AA3=-1,\"-\",TEXT(AA3,0))))","v":"-7"},{"$f":"IF(AA3=0,\"\",CONCATENATE(AB3,$C3))","v":"-7i"},{"$f":"((-1)^$K3*$J3+(-1)^$T3*$S3)","v":9},{"$f":"IF(AD3=0,\"\",IF(AD3<0,\" - \",IF(AA3=0,\"\",\" + \")))","v":" + "},{"$f":"IF(AD3=0,\"\",IF(AD3=1,\"\",IF(AD3=-1,\"\",TEXT(ABS(AD3),0))))","v":"9"},{"$f":"IF(AD3=0,\"\",CONCATENATE(AF3,$E3))","v":"9x"},{"$f":"IF(AD3=0,AC3,CONCATENATE(AC3,AE3,AG3))","v":"-7i + 9x"},null,{"$f":"CONCATENATE($H3,$I3,$C3,$L3,$M3,$C3,$P3,$Q3,$C3,$U3,$V3,$E3,\" =\")","v":"2i + 5i - 9i + 4x ="},{"$f":"((-1)^$G3*$F3+(-1)^$K3*$J3+(-1)^$O3*$N3)","v":-2},{"$f":"IF(AK3=0,\"\",IF(AK3=1,\"\",IF(AK3=-1,\"-\",TEXT(AK3,0))))","v":"-2"},{"$f":"IF(AK3=0,\"\",CONCATENATE(AL3,$C3))","v":"-2i"},{"$f":"((-1)^$T3*$S3)","v":4},{"$f":"IF(AN3=0,\"\",IF(AN3<0,\" - \",IF(AK3=0,\"\",\" + \")))","v":" + "},{"$f":"IF(AN3=0,\"\",IF(AN3=1,\"\",IF(AN3=-1,\"\",TEXT(ABS(AN3),0))))","v":"4"},{"$f":"IF(AN3=0,\"\",CONCATENATE(AP3,$E3))","v":"4x"},{"$f":"IF(AN3=0,AM3,CONCATENATE(AM3,AO3,AQ3))","v":"-2i + 4x"},null,{"$f":"CONCATENATE($H3,$I3,$C3,$L3,$M3,$E3,$P3,$Q3,$E3,$U3,$V3,$E3,\" =\")","v":"2i + 5x - 9x + 4x ="},{"$f":"((-1)^$G3*$F3)","v":2},{"$f":"IF(AU3=0,\"\",IF(AU3=1,\"\",IF(AU3=-1,\"-\",TEXT(AU3,0))))","v":"2"},{"$f":"IF(AU3=0,\"\",CONCATENATE(AV3,$C3))","v":"2i"},{"$f":"((-1)^$K3*$J3+(-1)^$O3*$N3+((-1)^$T3*$S3))","v":0},{"$f":"IF(AX3=0,\"\",IF(AX3<0,\" - \",IF(AU3=0,\"\",\" + \")))","v":""},{"$f":"IF(AX3=0,\"\",IF(AX3=1,\"\",IF(AX3=-1,\"\",TEXT(ABS(AX3),0))))","v":""},{"$f":"IF(AX3=0,\"\",CONCATENATE(AZ3,$E3))","v":""},{"$f":"IF(AX3=0,AW3,CONCATENATE(AW3,AY3,BA3))","v":"2i"},null,{"$f":"CONCATENATE($H3,$I3,$C3,$L3,$M3,$E3,$P3,$Q3,$E3,$U3,$V3,$C3,\" =\")","v":"2i + 5x - 9x + 4i ="},{"$f":"((-1)^$G3*$F3+(-1)^$T3*$S3)","v":6},{"$f":"IF(BE3=0,\"\",IF(BE3=1,\"\",IF(BE3=-1,\"-\",TEXT(BE3,0))))","v":"6"},{"$f":"IF(BE3=0,\"\",CONCATENATE(BF3,$C3))","v":"6i"},{"$f":"((-1)^$O3*$N3+(-1)^$K3*$J3)","v":-4},{"$f":"IF(BH3=0,\"\",IF(BH3<0,\" - \",IF(BE3=0,\"\",\" + \")))","v":" - "},{"$f":"IF(BH3=0,\"\",IF(BH3=1,\"\",IF(BH3=-1,\"\",TEXT(ABS(BH3),0))))","v":"4"},{"$f":"IF(BH3=0,\"\",CONCATENATE(BJ3,$E3))","v":"4x"},{"$f":"IF(BH3=0,BG3,CONCATENATE(BG3,BI3,BK3))","v":"6i - 4x"},null,{"$f":"OFFSET(Z3,0,VALUE(X3))","v":"2i + 5x - 9i + 4x ="},{"$f":"OFFSET(AH3,0,VALUE(X3))","v":"-7i + 9x"}]
[3,121,"y",107,"k",2,1,"-","2",2,0," + ","2",5,1," - ","5",null,8,1," - ","8",null,0,null,"-2y + 2k - 5y - 8k =",-7,"-7","-7y",-6," - ","6","6k","-7y - 6k",null,"-2y + 2y - 5y - 8k =",-5,"-5","-5y",-8," - ","8","8k","-5y - 8k",null,"-2y + 2k - 5k - 8k =",-2,"-2","-2y",-11," - ","11","11k","-2y - 11k",null,"-2y + 2k - 5k - 8y =",-10,"-10","-10y",-3," - ","3","3k","-10y - 3k",null,"-2y + 2k - 5y - 8k =","-7y - 6k"]
[4,117,"u",103,"g",6,1,"-","6",1,1," - ","",8,1," - ","8",null,7,1," - ","7",null,10,null,"-6u - g - 8u - 7g =",-14,"-14","-14u",-8," - ","8","8g","-14u - 8g",null,"-6u - u - 8u - 7g =",-15,"-15","-15u",-7," - ","7","7g","-15u - 7g",null,"-6u - g - 8g - 7g =",-6,"-6","-6u",-16," - ","16","16g","-6u - 16g",null,"-6u - g - 8g - 7u =",-13,"-13","-13u",-9," - ","9","9g","-13u - 9g",null,"-6u - u - 8u - 7g =","-15u - 7g"]
[5,113,"q",102,"f",8,0,"","8",2,1," - ","2",2,0," + ","2",null,4,1," - ","4",null,0,null,"8q - 2f + 2q - 4f =",10,"10","10q",-6," - ","6","6f","10q - 6f",null,"8q - 2q + 2q - 4f =",8,"8","8q",-4," - ","4","4f","8q - 4f",null,"8q - 2f + 2f - 4f =",8,"8","8q",-4," - ","4","4f","8q - 4f",null,"8q - 2f + 2f - 4q =",4,"4","4q",0,"","","","4q",null,"8q - 2f + 2q - 4f =","10q - 6f"]
[6,103,"g",106,"j",4,1,"-","4",7,0," + ","7",3,1," - ","3",null,2,0," + ","2",null,30,null,"-4g + 7j - 3g + 2j =",-7,"-7","-7g",9," + ","9","9j","-7g + 9j",null,"-4g + 7g - 3g + 2j =",0,"","",2,"","2","2j","2j",null,"-4g + 7j - 3j + 2j =",-4,"-4","-4g",6," + ","6","6j","-4g + 6j",null,"-4g + 7j - 3j + 2g =",-2,"-2","-2g",4," + ","4","4j","-2g + 4j",null,"-4g + 7j - 3j + 2g =","-2g + 4j"]
[7,100,"d",105,"i",3,1,"-","3",8,1," - ","8",1,1," - ","",null,3,1," - ","3",null,10,null,"-3d - 8i - d - 3i =",-4,"-4","-4d",-11," - ","11","11i","-4d - 11i",null,"-3d - 8d - d - 3i =",-12,"-12","-12d",-3," - ","3","3i","-12d - 3i",null,"-3d - 8i - i - 3i =",-3,"-3","-3d",-12," - ","12","12i","-3d - 12i",null,"-3d - 8i - i - 3d =",-6,"-6","-6d",-9," - ","9","9i","-6d - 9i",null,"-3d - 8d - d - 3i =","-12d - 3i"]
[8,99,"c",103,"g",2,0,"","2",9,0," + ","9",9,0," + ","9",null,9,1," - ","9",null,20,null,"2c + 9g + 9c - 9g =",11,"11","11c",0,"","","","11c",null,"2c + 9c + 9c - 9g =",20,"20","20c",-9," - ","9","9g","20c - 9g",null,"2c + 9g + 9g - 9g =",2,"2","2c",9," + ","9","9g","2c + 9g",null,"2c + 9g + 9g - 9c =",-7,"-7","-7c",18," + ","18","18g","-7c + 18g",null,"2c + 9g + 9g - 9g =","2c + 9g"]
[9,122,"z",99,"c",5,0,"","5",9,0," + ","9",6,0," + ","6",null,2,1," - ","2",null,20,null,"5z + 9c + 6z - 2c =",11,"11","11z",7," + ","7","7c","11z + 7c",null,"5z + 9z + 6z - 2c =",20,"20","20z",-2," - ","2","2c","20z - 2c",null,"5z + 9c + 6c - 2c =",5,"5","5z",13," + ","13","13c","5z + 13c",null,"5z + 9c + 6c - 2z =",3,"3","3z",15," + ","15","15c","3z + 15c",null,"5z + 9c + 6c - 2c =","5z + 13c"]
[10,116,"t",116,"t",8,1,"-","8",9,1," - ","9",4,0," + ","4",null,8,1," - ","8",null,10,null,"-8t - 9t + 4t - 8t =",-4,"-4","-4t",-17," - ","17","17t","-4t - 17t",null,"-8t - 9t + 4t - 8t =",-13,"-13","-13t",-8," - ","8","8t","-13t - 8t",null,"-8t - 9t + 4t - 8t =",-8,"-8","-8t",-13," - ","13","13t","-8t - 13t",null,"-8t - 9t + 4t - 8t =",-16,"-16","-16t",-5," - ","5","5t","-16t - 5t",null,"-8t - 9t + 4t - 8t =","-13t - 8t"]
[11,122,"z",113,"q",1,1,"-","",4,0," + ","4",3,0," + ","3",null,5,1," - ","5",null,20,null,"-z + 4q + 3z - 5q =",2,"2","2z",-1," - ","","q","2z - q",null,"-z + 4z + 3z - 5q =",6,"6","6z",-5," - ","5","5q","6z - 5q",null,"-z + 4q + 3q - 5q =",-1,"-","-z",2," + ","2","2q","-z + 2q",null,"-z + 4q + 3q - 5z =",-6,"-6","-6z",7," + ","7","7q","-6z + 7q",null,"-z + 4q + 3q - 5q =","-z + 2q"]
[12,110,"n",114,"r",2,0,"","2",5,1," - ","5",5,0," + ","5",null,8,0," + ","8",null,30,null,"2n - 5r + 5n + 8r =",7,"7","7n",3," + ","3","3r","7n + 3r",null,"2n - 5n + 5n + 8r =",2,"2","2n",8," + ","8","8r","2n + 8r",null,"2n - 5r + 5r + 8r =",2,"2","2n",8," + ","8","8r","2n + 8r",null,"2n - 5r + 5r + 8n =",10,"10","10n",0,"","","","10n",null,"2n - 5r + 5r + 8n =","10n"]
[13,98,"b",119,"w",4,1,"-","4",7,1," - ","7",3,1," - ","3",null,5,0," + ","5",null,30,null,"-4b - 7w - 3b + 5w =",-7,"-7","-7b",-2," - ","2","2w","-7b - 2w",null,"-4b - 7b - 3b + 5w =",-14,"-14","-14b",5," + ","5","5w","-14b + 5w",null,"-4b - 7w - 3w + 5w =",-4,"-4","-4b",-5," - ","5","5w","-4b - 5w",null,"-4b - 7w - 3w + 5b =",1,"","b",-10," - ","10","10w","b - 10w",null,"-4b - 7w - 3w + 5b =","b - 10w"]
[14,118,"v",115,"s",7,0,"","7",4,0," + ","4",9,0," + ","9",null,6,0," + ","6",null,0,null,"7v + 4s + 9v + 6s =",16,"16","16v",10," + ","10","10s","16v + 10s",null,"7v + 4v + 9v + 6s =",20,"20","20v",6," + ","6","6s","20v + 6s",null,"7v + 4s + 9s + 6s =",7,"7","7v",19," + ","19","19s","7v + 19s",null,"7v + 4s + 9s + 6v =",13,"13","13v",13," + ","13","13s","13v + 13s",null,"7v + 4s + 9v + 6s =","16v + 10s"]
[15,111,"o",102,"f",3,1,"-","3",9,1," - ","9",6,0," + ","6",null,1,0," + ","",null,30,null,"-3o - 9f + 6o + f =",3,"3","3o",-8," - ","8","8f","3o - 8f",null,"-3o - 9o + 6o + f =",-6,"-6","-6o",1," + ","","f","-6o + f",null,"-3o - 9f + 6f + f =",-3,"-3","-3o",-2," - ","2","2f","-3o - 2f",null,"-3o - 9f + 6f + o =",-2,"-2","-2o",-3," - ","3","3f","-2o - 3f",null,"-3o - 9f + 6f + o =","-2o - 3f"]
[16,103,"g",114,"r",5,0,"","5",6,0," + ","6",7,1," - ","7",null,9,0," + ","9",null,0,null,"5g + 6r - 7g + 9r =",-2,"-2","-2g",15," + ","15","15r","-2g + 15r",null,"5g + 6g - 7g + 9r =",4,"4","4g",9," + ","9","9r","4g + 9r",null,"5g + 6r - 7r + 9r =",5,"5","5g",8," + ","8","8r","5g + 8r",null,"5g + 6r - 7r + 9g =",14,"14","14g",-1," - ","","r","14g - r",null,"5g + 6r - 7g + 9r =","-2g + 15r"]
[17,112,"p",98,"b",8,0,"","8",3,0," + ","3",3,1," - ","3",null,4,1," - ","4",null,10,null,"8p + 3b - 3p - 4b =",5,"5","5p",-1," - ","","b","5p - b",null,"8p + 3p - 3p - 4b =",8,"8","8p",-4," - ","4","4b","8p - 4b",null,"8p + 3b - 3b - 4b =",8,"8","8p",-4," - ","4","4b","8p - 4b",null,"8p + 3b - 3b - 4p =",4,"4","4p",0,"","","","4p",null,"8p + 3p - 3p - 4b =","8p - 4b"]
[18,119,"w",118,"v",1,0,"","",1,1," - ","",3,0," + ","3",null,6,1," - ","6",null,10,null,"w - v + 3w - 6v =",4,"4","4w",-7," - ","7","7v","4w - 7v",null,"w - w + 3w - 6v =",3,"3","3w",-6," - ","6","6v","3w - 6v",null,"w - v + 3v - 6v =",1,"","w",-4," - ","4","4v","w - 4v",null,"w - v + 3v - 6w =",-5,"-5","-5w",2," + ","2","2v","-5w + 2v",null,"w - w + 3w - 6v =","3w - 6v"]
[19,97,"a",106,"j",4,1,"-","4",8,1," - ","8",7,0," + ","7",null,3,0," + ","3",null,10,null,"-4a - 8j + 7a + 3j =",3,"3","3a",-5," - ","5","5j","3a - 5j",null,"-4a - 8a + 7a + 3j =",-5,"-5","-5a",3," + ","3","3j","-5a + 3j",null,"-4a - 8j + 7j + 3j =",-4,"-4","-4a",2," + ","2","2j","-4a + 2j",null,"-4a - 8j + 7j + 3a =",-1,"-","-a",-1," - ","","j","-a - j",null,"-4a - 8a + 7a + 3j =","-5a + 3j"]
[20,121,"y",100,"d",9,0,"","9",7,0," + ","7",1,0," + ","",null,4,0," + ","4",null,0,null,"9y + 7d + y + 4d =",10,"10","10y",11," + ","11","11d","10y + 11d",null,"9y + 7y + y + 4d =",17,"17","17y",4," + ","4","4d","17y + 4d",null,"9y + 7d + d + 4d =",9,"9","9y",12," + ","12","12d","9y + 12d",null,"9y + 7d + d + 4y =",13,"13","13y",8," + ","8","8d","13y + 8d",null,"9y + 7d + y + 4d =","10y + 11d"]
[21,103,"g",101,"e",8,1,"-","8",7,0," + ","7",7,0," + ","7",null,2,1," - ","2",null,30,null,"-8g + 7e + 7g - 2e =",-1,"-","-g",5," + ","5","5e","-g + 5e",null,"-8g + 7g + 7g - 2e =",6,"6","6g",-2," - ","2","2e","6g - 2e",null,"-8g + 7e + 7e - 2e =",-8,"-8","-8g",12," + ","12","12e","-8g + 12e",null,"-8g + 7e + 7e - 2g =",-10,"-10","-10g",14," + ","14","14e","-10g + 14e",null,"-8g + 7e + 7e - 2g =","-10g + 14e"]
[22,101,"e",102,"f",8,1,"-","8",9,1," - ","9",9,0," + ","9",null,5,0," + ","5",null,10,null,"-8e - 9f + 9e + 5f =",1,"","e",-4," - ","4","4f","e - 4f",null,"-8e - 9e + 9e + 5f =",-8,"-8","-8e",5," + ","5","5f","-8e + 5f",null,"-8e - 9f + 9f + 5f =",-8,"-8","-8e",5," + ","5","5f","-8e + 5f",null,"-8e - 9f + 9f + 5e =",-3,"-3","-3e",0,"","","","-3e",null,"-8e - 9e + 9e + 5f =","-8e + 5f"]
[23,110,"n",118,"v",9,0,"","9",2,0," + ","2",6,0," + ","6",null,6,0," + ","6",null,0,null,"9n + 2v + 6n + 6v =",15,"15","15n",8," + ","8","8v","15n + 8v",null,"9n + 2n + 6n + 6v =",17,"17","17n",6," + ","6","6v","17n + 6v",null,"9n + 2v + 6v + 6v =",9,"9","9n",14," + ","14","14v","9n + 14v",null,"9n + 2v + 6v + 6n =",15,"15","15n",8," + ","8","8v","15n + 8v",null,"9n + 2v + 6n + 6v =","15n + 8v"]
[24,102,"f",110,"n",7,1,"-","7",1,0," + ","",4,1," - ","4",null,9,0," + ","9",null,30,null,"-7f + n - 4f + 9n =",-11,"-11","-11f",10," + ","10","10n","-11f + 10n",null,"-7f + f - 4f + 9n =",-10,"-10","-10f",9," + ","9","9n","-10f + 9n",null,"-7f + n - 4n + 9n =",-7,"-7","-7f",6," + ","6","6n","-7f + 6n",null,"-7f + n - 4n + 9f =",2,"2","2f",-3," - ","3","3n","2f - 3n",null,"-7f + n - 4n + 9f =","2f - 3n"]
[25,109,"m",110,"n",5,0,"","5",5,0," + ","5",7,1," - ","7",null,4,1," - ","4",null,10,null,"5m + 5n - 7m - 4n =",-2,"-2","-2m",1," + ","","n","-2m + n",null,"5m + 5m - 7m - 4n =",3,"3","3m",-4," - ","4","4n","3m - 4n",null,"5m + 5n - 7n - 4n =",5,"5","5m",-6," - ","6","6n","5m - 6n",null,"5m + 5n - 7n - 4m =",1,"","m",-2," - ","2","2n","m - 2n",null,"5m + 5m - 7m - 4n =","3m - 4n"]
[26,119,"w",103,"g",6,1,"-","6",3,0," + ","3",3,0," + ","3",null,5,0," + ","5",null,30,null,"-6w + 3g + 3w + 5g =",-3,"-3","-3w",8," + ","8","8g","-3w + 8g",null,"-6w + 3w + 3w + 5g =",0,"","",5,"","5","5g","5g",null,"-6w + 3g + 3g + 5g =",-6,"-6","-6w",11," + ","11","11g","-6w + 11g",null,"-6w + 3g + 3g + 5w =",-1,"-","-w",6," + ","6","6g","-w + 6g",null,"-6w + 3g + 3g + 5w =","-w + 6g"]
[27,98,"b",105,"i",6,1,"-","6",4,0," + ","4",5,1," - ","5",null,9,0," + ","9",null,0,null,"-6b + 4i - 5b + 9i =",-11,"-11","-11b",13," + ","13","13i","-11b + 13i",null,"-6b + 4b - 5b + 9i =",-7,"-7","-7b",9," + ","9","9i","-7b + 9i",null,"-6b + 4i - 5i + 9i =",-6,"-6","-6b",8," + ","8","8i","-6b + 8i",null,"-6b + 4i - 5i + 9b =",3,"3","3b",-1," - ","","i","3b - i",null,"-6b + 4i - 5b + 9i =","-11b + 13i"]
[28,98,"b",121,"y",7,1,"-","7",9,0," + ","9",2,1," - ","2",null,6,0," + ","6",null,20,null,"-7b + 9y - 2b + 6y =",-9,"-9","-9b",15," + ","15","15y","-9b + 15y",null,"-7b + 9b - 2b + 6y =",0,"","",6,"","6","6y","6y",null,"-7b + 9y - 2y + 6y =",-7,"-7","-7b",13," + ","13","13y","-7b + 13y",null,"-7b + 9y - 2y + 6b =",-1,"-","-b",7," + ","7","7y","-b + 7y",null,"-7b + 9y - 2y + 6y =","-7b + 13y"]
[29,116,"t",122,"z",4,0,"","4",6,0," + ","6",8,1," - ","8",null,6,0," + ","6",null,30,null,"4t + 6z - 8t + 6z =",-4,"-4","-4t",12," + ","12","12z","-4t + 12z",null,"4t + 6t - 8t + 6z =",2,"2","2t",6," + ","6","6z","2t + 6z",null,"4t + 6z - 8z + 6z =",4,"4","4t",4," + ","4","4z","4t + 4z",null,"4t + 6z - 8z + 6t =",10,"10","10t",-2," - ","2","2z","10t - 2z",null,"4t + 6z - 8z + 6t =","10t - 2z"]
[30,110,"n",120,"x",5,0,"","5",7,0," + ","7",1,1," - ","",null,2,1," - ","2",null,20,null,"5n + 7x - n - 2x =",4,"4","4n",5," + ","5","5x","4n + 5x",null,"5n + 7n - n - 2x =",11,"11","11n",-2," - ","2","2x","11n - 2x",null,"5n + 7x - x - 2x =",5,"5","5n",4," + ","4","4x","5n + 4x",null,"5n + 7x - x - 2n =",3,"3","3n",6," + ","6","6x","3n + 6x",null,"5n + 7x - x - 2x =","5n + 4x"]
[31,111,"o",103,"g",1,0,"","",7,1," - ","7",7,0," + ","7",null,4,0," + ","4",null,20,null,"o - 7g + 7o + 4g =",8,"8","8o",-3," - ","3","3g","8o - 3g",null,"o - 7o + 7o + 4g =",1,"","o",4," + ","4","4g","o + 4g",null,"o - 7g + 7g + 4g =",1,"","o",4," + ","4","4g","o + 4g",null,"o - 7g + 7g + 4o =",5,"5","5o",0,"","","","5o",null,"o - 7g + 7g + 4g =","o + 4g"]
[32,101,"e",117,"u",2,1,"-","2",2,1," - ","2",9,1," - ","9",null,7,1," - ","7",null,10,null,"-2e - 2u - 9e - 7u =",-11,"-11","-11e",-9," - ","9","9u","-11e - 9u",null,"-2e - 2e - 9e - 7u =",-13,"-13","-13e",-7," - ","7","7u","-13e - 7u",null,"-2e - 2u - 9u - 7u =",-2,"-2","-2e",-18," - ","18","18u","-2e - 18u",null,"-2e - 2u - 9u - 7e =",-9,"-9","-9e",-11," - ","11","11u","-9e - 11u",null,"-2e - 2e - 9e - 7u =","-13e - 7u"]
[33,107,"k",120,"x",3,0,"","3",4,0," + ","4",7,1," - ","7",null,6,1," - ","6",null,0,null,"3k + 4x - 7k - 6x =",-4,"-4","-4k",-2," - ","2","2x","-4k - 2x",null,"3k + 4k - 7k - 6x =",0,"","",-6," - ","6","6x"," - 6x",null,"3k + 4x - 7x - 6x =",3,"3","3k",-9," - ","9","9x","3k - 9x",null,"3k + 4x - 7x - 6k =",-3,"-3","-3k",-3," - ","3","3x","-3k - 3x",null,"3k + 4x - 7k - 6x =","-4k - 2x"]
[34,98,"b",102,"f",4,1,"-","4",5,1," - ","5",6,1," - ","6",null,8,0," + ","8",null,30,null,"-4b - 5f - 6b + 8f =",-10,"-10","-10b",3," + ","3","3f","-10b + 3f",null,"-4b - 5b - 6b + 8f =",-15,"-15","-15b",8," + ","8","8f","-15b + 8f",null,"-4b - 5f - 6f + 8f =",-4,"-4","-4b",-3," - ","3","3f","-4b - 3f",null,"-4b - 5f - 6f + 8b =",4,"4","4b",-11," - ","11","11f","4b - 11f",null,"-4b - 5f - 6f + 8b =","4b - 11f"]
[35,109,"m",118,"v",1,1,"-","",2,0," + ","2",2,0," + ","2",null,4,0," + ","4",null,10,null,"-m + 2v + 2m + 4v =",1,"","m",6," + ","6","6v","m + 6v",null,"-m + 2m + 2m + 4v =",3,"3","3m",4," + ","4","4v","3m + 4v",null,"-m + 2v + 2v + 4v =",-1,"-","-m",8," + ","8","8v","-m + 8v",null,"-m + 2v + 2v + 4m =",3,"3","3m",4," + ","4","4v","3m + 4v",null,"-m + 2m + 2m + 4v =","3m + 4v"]
[36,99,"c",102,"f",4,1,"-","4",2,0," + ","2",1,0," + ","",null,3,1," - ","3",null,10,null,"-4c + 2f + c - 3f =",-3,"-3","-3c",-1," - ","","f","-3c - f",null,"-4c + 2c + c - 3f =",-1,"-","-c",-3," - ","3","3f","-c - 3f",null,"-4c + 2f + f - 3f =",-4,"-4","-4c",0,"","","","-4c",null,"-4c + 2f + f - 3c =",-7,"-7","-7c",3," + ","3","3f","-7c + 3f",null,"-4c + 2c + c - 3f =","-c - 3f"]
[37,120,"x",100,"d",5,0,"","5",5,0," + ","5",1,0," + ","",null,8,1," - ","8",null,0,null,"5x + 5d + x - 8d =",6,"6","6x",-3," - ","3","3d","6x - 3d",null,"5x + 5x + x - 8d =",11,"11","11x",-8," - ","8","8d","11x - 8d",null,"5x + 5d + d - 8d =",5,"5","5x",-2," - ","2","2d","5x - 2d",null,"5x + 5d + d - 8x =",-3,"-3","-3x",6," + ","6","6d","-3x + 6d",null,"5x + 5d + x - 8d =","6x - 3d"]
[38,104,"h",112,"p",6,0,"","6",7,0," + ","7",2,1," - ","2",null,8,0," + ","8",null,10,null,"6h + 7p - 2h + 8p =",4,"4","4h",15," + ","15","15p","4h + 15p",null,"6h + 7h - 2h + 8p =",11,"11","11h",8," + ","8","8p","11h + 8p",null,"6h + 7p - 2p + 8p =",6,"6","6h",13," + ","13","13p","6h + 13p",null,"6h + 7p - 2p + 8h =",14,"14","14h",5," + ","5","5p","14h + 5p",null,"6h + 7h - 2h + 8p =","11h + 8p"]
[39,103,"g",117,"u",6,0,"","6",3,1," - ","3",8,0," + ","8",null,9,0," + ","9",null,10,null,"6g - 3u + 8g + 9u =",14,"14","14g",6," + ","6","6u","14g + 6u",null,"6g - 3g + 8g + 9u =",11,"11","11g",9," + ","9","9u","11g + 9u",null,"6g - 3u + 8u + 9u =",6,"6","6g",14," + ","14","14u","6g + 14u",null,"6g - 3u + 8u + 9g =",15,"15","15g",5," + ","5","5u","15g + 5u",null,"6g - 3g + 8g + 9u =","11g + 9u"]
[40,103,"g",110,"n",5,1,"-","5",4,1," - ","4",8,0," + ","8",null,8,0," + ","8",null,30,null,"-5g - 4n + 8g + 8n =",3,"3","3g",4," + ","4","4n","3g + 4n",null,"-5g - 4g + 8g + 8n =",-1,"-","-g",8," + ","8","8n","-g + 8n",null,"-5g - 4n + 8n + 8n =",-5,"-5","-5g",12," + ","12","12n","-5g + 12n",null,"-5g - 4n + 8n + 8g =",3,"3","3g",4," + ","4","4n","3g + 4n",null,"-5g - 4n + 8n + 8g =","3g + 4n"]
[41,111,"o",113,"q",2,1,"-","2",8,1," - ","8",9,0," + ","9",null,4,0," + ","4",null,30,null,"-2o - 8q + 9o + 4q =",7,"7","7o",-4," - ","4","4q","7o - 4q",null,"-2o - 8o + 9o + 4q =",-1,"-","-o",4," + ","4","4q","-o + 4q",null,"-2o - 8q + 9q + 4q =",-2,"-2","-2o",5," + ","5","5q","-2o + 5q",null,"-2o - 8q + 9q + 4o =",2,"2","2o",1," + ","","q","2o + q",null,"-2o - 8q + 9q + 4o =","2o + q"]
[42,101,"e",110,"n",1,1,"-","",5,0," + ","5",1,0," + ","",null,4,1," - ","4",null,30,null,"-e + 5n + e - 4n =",0,"","",1,"","","n","n",null,"-e + 5e + e - 4n =",5,"5","5e",-4," - ","4","4n","5e - 4n",null,"-e + 5n + n - 4n =",-1,"-","-e",2," + ","2","2n","-e + 2n",null,"-e + 5n + n - 4e =",-5,"-5","-5e",6," + ","6","6n","-5e + 6n",null,"-e + 5n + n - 4e =","-5e + 6n"]
[43,102,"f",114,"r",4,1,"-","4",7,0," + ","7",5,1," - ","5",null,8,0," + ","8",null,30,null,"-4f + 7r - 5f + 8r =",-9,"-9","-9f",15," + ","15","15r","-9f + 15r",null,"-4f + 7f - 5f + 8r =",-2,"-2","-2f",8," + ","8","8r","-2f + 8r",null,"-4f + 7r - 5r + 8r =",-4,"-4","-4f",10," + ","10","10r","-4f + 10r",null,"-4f + 7r - 5r + 8f =",4,"4","4f",2," + ","2","2r","4f + 2r",null,"-4f + 7r - 5r + 8f =","4f + 2r"]
[44,97,"a",100,"d",5,1,"-","5",6,0," + ","6",4,1," - ","4",null,7,0," + ","7",null,30,null,"-5a + 6d - 4a + 7d =",-9,"-9","-9a",13," + ","13","13d","-9a + 13d",null,"-5a + 6a - 4a + 7d =",-3,"-3","-3a",7," + ","7","7d","-3a + 7d",null,"-5a + 6d - 4d + 7d =",-5,"-5","-5a",9," + ","9","9d","-5a + 9d",null,"-5a + 6d - 4d + 7a =",2,"2","2a",2," + ","2","2d","2a + 2d",null,"-5a + 6d - 4d + 7a =","2a + 2d"]
[45,102,"f",119,"w",3,0,"","3",8,1," - ","8",1,0," + ","",null,7,0," + ","7",null,10,null,"3f - 8w + f + 7w =",4,"4","4f",-1," - ","","w","4f - w",null,"3f - 8f + f + 7w =",-4,"-4","-4f",7," + ","7","7w","-4f + 7w",null,"3f - 8w + w + 7w =",3,"3","3f",0,"","","","3f",null,"3f - 8w + w + 7f =",10,"10","10f",-7," - ","7","7w","10f - 7w",null,"3f - 8f + f + 7w =","-4f + 7w"]
[46,98,"b",122,"z",4,0,"","4",1,0," + ","",2,0," + ","2",null,3,1," - ","3",null,10,null,"4b + z + 2b - 3z =",6,"6","6b",-2," - ","2","2z","6b - 2z",null,"4b + b + 2b - 3z =",7,"7","7b",-3," - ","3","3z","7b - 3z",null,"4b + z + 2z - 3z =",4,"4","4b",0,"","","","4b",null,"4b + z + 2z - 3b =",1,"","b",3," + ","3","3z","b + 3z",null,"4b + b + 2b - 3z =","7b - 3z"]
[47,111,"o",110,"n",1,0,"","",2,0," + ","2",2,0," + ","2",null,5,1," - ","5",null,10,null,"o + 2n + 2o - 5n =",3,"3","3o",-3," - ","3","3n","3o - 3n",null,"o + 2o + 2o - 5n =",5,"5","5o",-5," - ","5","5n","5o - 5n",null,"o + 2n + 2n - 5n =",1,"","o",-1," - ","","n","o - n",null,"o + 2n + 2n - 5o =",-4,"-4","-4o",4," + ","4","4n","-4o + 4n",null,"o + 2o + 2o - 5n =","5o - 5n"]
[48,99,"c",98,"b",7,0,"","7",1,0," + ","",2,0," + ","2",null,3,1," - ","3",null,10,null,"7c + b + 2c - 3b =",9,"9","9c",-2," - ","2","2b","9c - 2b",null,"7c + c + 2c - 3b =",10,"10","10c",-3," - ","3","3b","10c - 3b",null,"7c + b + 2b - 3b =",7,"7","7c",0,"","","","7c",null,"7c + b + 2b - 3c =",4,"4","4c",3," + ","3","3b","4c + 3b",null,"7c + c + 2c - 3b =","10c - 3b"]
[49,101,"e",114,"r",2,1,"-","2",5,1," - ","5",9,1," - ","9",null,2,1," - ","2",null,0,null,"-2e - 5r - 9e - 2r =",-11,"-11","-11e",-7," - ","7","7r","-11e - 7r",null,"-2e - 5e - 9e - 2r =",-16,"-16","-16e",-2," - ","2","2r","-16e - 2r",null,"-2e - 5r - 9r - 2r =",-2,"-2","-2e",-16," - ","16","16r","-2e - 16r",null,"-2e - 5r - 9r - 2e =",-4,"-4","-4e",-14," - ","14","14r","-4e - 14r",null,"-2e - 5r - 9e - 2r =","-11e - 7r"]
[50,120,"x",106,"j",7,0,"","7",5,1," - ","5",8,0," + ","8",null,3,1," - ","3",null,10,null,"7x - 5j + 8x - 3j =",15,"15","15x",-8," - ","8","8j","15x - 8j",null,"7x - 5x + 8x - 3j =",10,"10","10x",-3," - ","3","3j","10x - 3j",null,"7x - 5j + 8j - 3j =",7,"7","7x",0,"","","","7x",null,"7x - 5j + 8j - 3x =",4,"4","4x",3," + ","3","3j","4x + 3j",null,"7x - 5x + 8x - 3j =","10x - 3j"]
[51,110,"n",102,"f",9,1,"-","9",4,0," + ","4",9,0," + ","9",null,2,0," + ","2",null,30,null,"-9n + 4f + 9n + 2f =",0,"","",6,"","6","6f","6f",null,"-9n + 4n + 9n + 2f =",4,"4","4n",2," + ","2","2f","4n + 2f",null,"-9n + 4f + 9f + 2f =",-9,"-9","-9n",15," + ","15","15f","-9n + 15f",null,"-9n + 4f + 9f + 2n =",-7,"-7","-7n",13," + ","13","13f","-7n + 13f",null,"-9n + 4f + 9f + 2n =","-7n + 13f"]
[52,106,"j",120,"x",7,0,"","7",2,0," + ","2",4,1," - ","4",null,7,0," + ","7",null,30,null,"7j + 2x - 4j + 7x =",3,"3","3j",9," + ","9","9x","3j + 9x",null,"7j + 2j - 4j + 7x =",5,"5","5j",7," + ","7","7x","5j + 7x",null,"7j + 2x - 4x + 7x =",7,"7","7j",5," + ","5","5x","7j + 5x",null,"7j + 2x - 4x + 7j =",14,"14","14j",-2," - ","2","2x","14j - 2x",null,"7j + 2x - 4x + 7j =","14j - 2x"]
[53,115,"s",110,"n",6,1,"-","6",2,1," - ","2",2,1," - ","2",null,8,1," - ","8",null,20,null,"-6s - 2n - 2s - 8n =",-8,"-8","-8s",-10," - ","10","10n","-8s - 10n",null,"-6s - 2s - 2s - 8n =",-10,"-10","-10s",-8," - ","8","8n","-10s - 8n",null,"-6s - 2n - 2n - 8n =",-6,"-6","-6s",-12," - ","12","12n","-6s - 12n",null,"-6s - 2n - 2n - 8s =",-14,"-14","-14s",-4," - ","4","4n","-14s - 4n",null,"-6s - 2n - 2n - 8n =","-6s - 12n"]
[54,105,"i",110,"n",6,0,"","6",7,0," + ","7",8,1," - ","8",null,1,1," - ","",null,30,null,"6i + 7n - 8i - n =",-2,"-2","-2i",6," + ","6","6n","-2i + 6n",null,"6i + 7i - 8i - n =",5,"5","5i",-1," - ","","n","5i - n",null,"6i + 7n - 8n - n =",6,"6","6i",-2," - ","2","2n","6i - 2n",null,"6i + 7n - 8n - i =",5,"5","5i",-1," - ","","n","5i - n",null,"6i + 7n - 8n - i =","5i - n"]
[55,118,"v",97,"a",4,1,"-","4",4,1," - ","4",8,0," + ","8",null,3,1," - ","3",null,10,null,"-4v - 4a + 8v - 3a =",4,"4","4v",-7," - ","7","7a","4v - 7a",null,"-4v - 4v + 8v - 3a =",0,"","",-3," - ","3","3a"," - 3a",null,"-4v - 4a + 8a - 3a =",-4,"-4","-4v",1," + ","","a","-4v + a",null,"-4v - 4a + 8a - 3v =",-7,"-7","-7v",4," + ","4","4a","-7v + 4a",null,"-4v - 4v + 8v - 3a ="," - 3a"]
[56,108,"m",118,"v",3,1,"-","3",4,1," - ","4",4,1," - ","4",null,8,0," + ","8",null,30,null,"-3m - 4v - 4m + 8v =",-7,"-7","-7m",4," + ","4","4v","-7m + 4v",null,"-3m - 4m - 4m + 8v =",-11,"-11","-11m",8," + ","8","8v","-11m + 8v",null,"-3m - 4v - 4v + 8v =",-3,"-3","-3m",0,"","","","-3m",null,"-3m - 4v - 4v + 8m =",5,"5","5m",-8," - ","8","8v","5m - 8v",null,"-3m - 4v - 4v + 8m =","5m - 8v"]
[57,112,"p",108,"m",8,1,"-","8",3,1," - ","3",7,0," + ","7",null,1,1," - ","",null,20,null,"-8p - 3m + 7p - m =",-1,"-","-p",-4," - ","4","4m","-p - 4m",null,"-8p - 3p + 7p - m =",-4,"-4","-4p",-1," - ","","m","-4p - m",null,"-8p - 3m + 7m - m =",-8,"-8","-8p",3," + ","3","3m","-8p + 3m",null,"-8p - 3m + 7m - p =",-9,"-9","-9p",4," + ","4","4m","-9p + 4m",null,"-8p - 3m + 7m - m =","-8p + 3m"]
[58,122,"z",117,"u",5,0,"","5",1,0," + ","",3,1," - ","3",null,9,1," - ","9",null,30,null,"5z + u - 3z - 9u =",2,"2","2z",-8," - ","8","8u","2z - 8u",null,"5z + z - 3z - 9u =",3,"3","3z",-9," - ","9","9u","3z - 9u",null,"5z + u - 3u - 9u =",5,"5","5z",-11," - ","11","11u","5z - 11u",null,"5z + u - 3u - 9z =",-4,"-4","-4z",-2," - ","2","2u","-4z - 2u",null,"5z + u - 3u - 9z =","-4z - 2u"]
[59,105,"i",100,"d",1,1,"-","",7,0," + ","7",1,0," + ","",null,5,0," + ","5",null,0,null,"-i + 7d + i + 5d =",0,"","",12,"","12","12d","12d",null,"-i + 7i + i + 5d =",7,"7","7i",5," + ","5","5d","7i + 5d",null,"-i + 7d + d + 5d =",-1,"-","-i",13," + ","13","13d","-i + 13d",null,"-i + 7d + d + 5i =",4,"4","4i",8," + ","8","8d","4i + 8d",null,"-i + 7d + i + 5d =","12d"]
[60,103,"g",112,"p",3,0,"","3",8,0," + ","8",5,1," - ","5",null,2,1," - ","2",null,20,null,"3g + 8p - 5g - 2p =",-2,"-2","-2g",6," + ","6","6p","-2g + 6p",null,"3g + 8g - 5g - 2p =",6,"6","6g",-2," - ","2","2p","6g - 2p",null,"3g + 8p - 5p - 2p =",3,"3","3g",1," + ","","p","3g + p",null,"3g + 8p - 5p - 2g =",1,"","g",3," + ","3","3p","g + 3p",null,"3g + 8p - 5p - 2p =","3g + p"]
[61,116,"t",112,"p",9,1,"-","9",7,1," - ","7",3,1," - ","3",null,4,1," - ","4",null,20,null,"-9t - 7p - 3t - 4p =",-12,"-12","-12t",-11," - ","11","11p","-12t - 11p",null,"-9t - 7t - 3t - 4p =",-19,"-19","-19t",-4," - ","4","4p","-19t - 4p",null,"-9t - 7p - 3p - 4p =",-9,"-9","-9t",-14," - ","14","14p","-9t - 14p",null,"-9t - 7p - 3p - 4t =",-13,"-13","-13t",-10," - ","10","10p","-13t - 10p",null,"-9t - 7p - 3p - 4p =","-9t - 14p"]
[62,118,"v",105,"i",5,1,"-","5",5,1," - ","5",6,0," + ","6",null,8,1," - ","8",null,10,null,"-5v - 5i + 6v - 8i =",1,"","v",-13," - ","13","13i","v - 13i",null,"-5v - 5v + 6v - 8i =",-4,"-4","-4v",-8," - ","8","8i","-4v - 8i",null,"-5v - 5i + 6i - 8i =",-5,"-5","-5v",-7," - ","7","7i","-5v - 7i",null,"-5v - 5i + 6i - 8v =",-13,"-13","-13v",1," + ","","i","-13v + i",null,"-5v - 5v + 6v - 8i =","-4v - 8i"]
[63,118,"v",100,"d",4,0,"","4",5,1," - ","5",7,1," - ","7",null,2,0," + ","2",null,20,null,"4v - 5d - 7v + 2d =",-3,"-3","-3v",-3," - ","3","3d","-3v - 3d",null,"4v - 5v - 7v + 2d =",-8,"-8","-8v",2," + ","2","2d","-8v + 2d",null,"4v - 5d - 7d + 2d =",4,"4","4v",-10," - ","10","10d","4v - 10d",null,"4v - 5d - 7d + 2v =",6,"6","6v",-12," - ","12","12d","6v - 12d",null,"4v - 5d - 7d + 2d =","4v - 10d"]
[64,113,"q",108,"m",3,1,"-","3",5,0," + ","5",2,0," + ","2",null,8,0," + ","8",null,20,null,"-3q + 5m + 2q + 8m =",-1,"-","-q",13," + ","13","13m","-q + 13m",null,"-3q + 5q + 2q + 8m =",4,"4","4q",8," + ","8","8m","4q + 8m",null,"-3q + 5m + 2m + 8m =",-3,"-3","-3q",15," + ","15","15m","-3q + 15m",null,"-3q + 5m + 2m + 8q =",5,"5","5q",7," + ","7","7m","5q + 7m",null,"-3q + 5m + 2m + 8m =","-3q + 15m"]
[65,104,"h",102,"f",4,1,"-","4",3,1," - ","3",9,0," + ","9",null,9,1," - ","9",null,30,null,"-4h - 3f + 9h - 9f =",5,"5","5h",-12," - ","12","12f","5h - 12f",null,"-4h - 3h + 9h - 9f =",2,"2","2h",-9," - ","9","9f","2h - 9f",null,"-4h - 3f + 9f - 9f =",-4,"-4","-4h",-3," - ","3","3f","-4h - 3f",null,"-4h - 3f + 9f - 9h =",-13,"-13","-13h",6," + ","6","6f","-13h + 6f",null,"-4h - 3f + 9f - 9h =","-13h + 6f"]
[66,{"$f":"INT(26*RAND()+97)","v":102},{"$f":"IF(B67=108,CHAR(B67+1),CHAR(B67))","v":"f"},{"$f":"INT(26*RAND()+97)","v":108},{"$f":"IF(D67=108,CHAR(D67+1),CHAR(D67))","v":"m"},{"$f":"INT(9*RAND()+1)","v":2},{"$f":"INT(2*RAND())","v":1},{"$f":"IF(G67=0,\"\",\"-\")","v":"-"},{"$f":"IF(F67=1,\"\",TEXT(F67,F67))","v":"2"},{"$f":"INT(9*RAND()+1)","v":4},{"$f":"INT(2*RAND())","v":0},{"$f":"IF(K67=0,\" + \",\" - \")","v":" + "},{"$f":"IF(J67=1,\"\",TEXT(J67,J67))","v":"4"},{"$f":"INT(9*RAND()+1)","v":6},{"$f":"INT(2*RAND())","v":1},{"$f":"IF(N67=0,\"\",IF(O67=0,\" + \",\" - \"))","v":" - "},{"$f":"IF(N67=0,\"\",IF(N67=1,\"\",TEXT(N67,N67)))","v":"6"},null,{"$f":"INT(9*RAND()+1)","v":6},{"$f":"INT(2*RAND())","v":1},{"$f":"IF(S67=0,\"\",IF(T67=0,\" + \",\" - \"))","v":" - "},{"$f":"IF(S67=0,\"\",IF(S67=1,\"\",TEXT(S67,0)))","v":"6"},null,{"$f":"10*INT(4*RAND())","v":30},null,{"$f":"CONCATENATE($H67,$I67,$C67,$L67,$M67,$E67,$P67,$Q67,$C67,$U67,$V67,$E67,\" =\")","v":"-2f + 4m - 6f - 6m ="},{"$f":"((-1)^$G67*$F67+(-1)^$O67*$N67)","v":-8},{"$f":"IF(AA67=0,\"\",IF(AA67=1,\"\",IF(AA67=-1,\"-\",TEXT(AA67,0))))","v":"-8"},{"$f":"IF(AA67=0,\"\",CONCATENATE(AB67,$C67))","v":"-8f"},{"$f":"((-1)^$K67*$J67+(-1)^$T67*$S67)","v":-2},{"$f":"IF(AD67=0,\"\",IF(AD67<0,\" - \",IF(AA67=0,\"\",\" + \")))","v":" - "},{"$f":"IF(AD67=0,\"\",IF(AD67=1,\"\",IF(AD67=-1,\"\",TEXT(ABS(AD67),0))))","v":"2"},{"$f":"IF(AD67=0,\"\",CONCATENATE(AF67,$E67))","v":"2m"},{"$f":"IF(AD67=0,AC67,CONCATENATE(AC67,AE67,AG67))","v":"-8f - 2m"},null,{"$f":"CONCATENATE($H67,$I67,$C67,$L67,$M67,$C67,$P67,$Q67,$C67,$U67,$V67,$E67,\" =\")","v":"-2f + 4f - 6f - 6m ="},{"$f":"((-1)^$G67*$F67+(-1)^$K67*$J67+(-1)^$O67*$N67)","v":-4},{"$f":"IF(AK67=0,\"\",IF(AK67=1,\"\",IF(AK67=-1,\"-\",TEXT(AK67,0))))","v":"-4"},{"$f":"IF(AK67=0,\"\",CONCATENATE(AL67,$C67))","v":"-4f"},{"$f":"((-1)^$T67*$S67)","v":-6},{"$f":"IF(AN67=0,\"\",IF(AN67<0,\" - \",IF(AK67=0,\"\",\" + \")))","v":" - "},{"$f":"IF(AN67=0,\"\",IF(AN67=1,\"\",IF(AN67=-1,\"\",TEXT(ABS(AN67),0))))","v":"6"},{"$f":"IF(AN67=0,\"\",CONCATENATE(AP67,$E67))","v":"6m"},{"$f":"IF(AN67=0,AM67,CONCATENATE(AM67,AO67,AQ67))","v":"-4f - 6m"},null,{"$f":"CONCATENATE($H67,$I67,$C67,$L67,$M67,$E67,$P67,$Q67,$E67,$U67,$V67,$E67,\" =\")","v":"-2f + 4m - 6m - 6m ="},{"$f":"((-1)^$G67*$F67)","v":-2},{"$f":"IF(AU67=0,\"\",IF(AU67=1,\"\",IF(AU67=-1,\"-\",TEXT(AU67,0))))","v":"-2"},{"$f":"IF(AU67=0,\"\",CONCATENATE(AV67,$C67))","v":"-2f"},{"$f":"((-1)^$K67*$J67+(-1)^$O67*$N67+((-1)^$T67*$S67))","v":-8},{"$f":"IF(AX67=0,\"\",IF(AX67<0,\" - \",IF(AU67=0,\"\",\" + \")))","v":" - "},{"$f":"IF(AX67=0,\"\",IF(AX67=1,\"\",IF(AX67=-1,\"\",TEXT(ABS(AX67),0))))","v":"8"},{"$f":"IF(AX67=0,\"\",CONCATENATE(AZ67,$E67))","v":"8m"},{"$f":"IF(AX67=0,AW67,CONCATENATE(AW67,AY67,BA67))","v":"-2f - 8m"},null,{"$f":"CONCATENATE($H67,$I67,$C67,$L67,$M67,$E67,$P67,$Q67,$E67,$U67,$V67,$C67,\" =\")","v":"-2f + 4m - 6m - 6f ="},{"$f":"((-1)^$G67*$F67+(-1)^$T67*$S67)","v":-8},{"$f":"IF(BE67=0,\"\",IF(BE67=1,\"\",IF(BE67=-1,\"-\",TEXT(BE67,0))))","v":"-8"},{"$f":"IF(BE67=0,\"\",CONCATENATE(BF67,$C67))","v":"-8f"},{"$f":"((-1)^$O67*$N67+(-1)^$K67*$J67)","v":-2},{"$f":"IF(BH67=0,\"\",IF(BH67<0,\" - \",IF(BE67=0,\"\",\" + \")))","v":" - "},{"$f":"IF(BH67=0,\"\",IF(BH67=1,\"\",IF(BH67=-1,\"\",TEXT(ABS(BH67),0))))","v":"2"},{"$f":"IF(BH67=0,\"\",CONCATENATE(BJ67,$E67))","v":"2m"},{"$f":"IF(BH67=0,BG67,CONCATENATE(BG67,BI67,BK67))","v":"-8f - 2m"},null,{"$f":"OFFSET(Z67,0,VALUE(X67))","v":"-2f + 4m - 6m - 6f ="},{"$f":"OFFSET(AH67,0,VALUE(X67))","v":"-8f - 2m"}]
[67,99,"c",116,"t",8,1,"-","8",4,1," - ","4",7,1," - ","7",null,7,0," + ","7",null,30,null,"-8c - 4t - 7c + 7t =",-15,"-15","-15c",3," + ","3","3t","-15c + 3t",null,"-8c - 4c - 7c + 7t =",-19,"-19","-19c",7," + ","7","7t","-19c + 7t",null,"-8c - 4t - 7t + 7t =",-8,"-8","-8c",-4," - ","4","4t","-8c - 4t",null,"-8c - 4t - 7t + 7c =",-1,"-","-c",-11," - ","11","11t","-c - 11t",null,"-8c - 4t - 7t + 7c =","-c - 11t"]
[68,119,"w",104,"h",2,0,"","2",9,1," - ","9",5,1," - ","5",null,1,1," - ","",null,20,null,"2w - 9h - 5w - h =",-3,"-3","-3w",-10," - ","10","10h","-3w - 10h",null,"2w - 9w - 5w - h =",-12,"-12","-12w",-1," - ","","h","-12w - h",null,"2w - 9h - 5h - h =",2,"2","2w",-15," - ","15","15h","2w - 15h",null,"2w - 9h - 5h - w =",1,"","w",-14," - ","14","14h","w - 14h",null,"2w - 9h - 5h - h =","2w - 15h"]
[69,118,"v",110,"n",7,0,"","7",5,1," - ","5",5,0," + ","5",null,4,1," - ","4",null,10,null,"7v - 5n + 5v - 4n =",12,"12","12v",-9," - ","9","9n","12v - 9n",null,"7v - 5v + 5v - 4n =",7,"7","7v",-4," - ","4","4n","7v - 4n",null,"7v - 5n + 5n - 4n =",7,"7","7v",-4," - ","4","4n","7v - 4n",null,"7v - 5n + 5n - 4v =",3,"3","3v",0,"","","","3v",null,"7v - 5v + 5v - 4n =","7v - 4n"]
[70,106,"j",97,"a",9,0,"","9",4,1," - ","4",4,1," - ","4",null,2,1," - ","2",null,30,null,"9j - 4a - 4j - 2a =",5,"5","5j",-6," - ","6","6a","5j - 6a",null,"9j - 4j - 4j - 2a =",1,"","j",-2," - ","2","2a","j - 2a",null,"9j - 4a - 4a - 2a =",9,"9","9j",-10," - ","10","10a","9j - 10a",null,"9j - 4a - 4a - 2j =",7,"7","7j",-8," - ","8","8a","7j - 8a",null,"9j - 4a - 4a - 2j =","7j - 8a"]
[71,122,"z",104,"h",5,1,"-","5",6,1," - ","6",3,1," - ","3",null,2,1," - ","2",null,0,null,"-5z - 6h - 3z - 2h =",-8,"-8","-8z",-8," - ","8","8h","-8z - 8h",null,"-5z - 6z - 3z - 2h =",-14,"-14","-14z",-2," - ","2","2h","-14z - 2h",null,"-5z - 6h - 3h - 2h =",-5,"-5","-5z",-11," - ","11","11h","-5z - 11h",null,"-5z - 6h - 3h - 2z =",-7,"-7","-7z",-9," - ","9","9h","-7z - 9h",null,"-5z - 6h - 3z - 2h =","-8z - 8h"]
[72,116,"t",105,"i",7,1,"-","7",5,1," - ","5",6,1," - ","6",null,3,0," + ","3",null,0,null,"-7t - 5i - 6t + 3i =",-13,"-13","-13t",-2," - ","2","2i","-13t - 2i",null,"-7t - 5t - 6t + 3i =",-18,"-18","-18t",3," + ","3","3i","-18t + 3i",null,"-7t - 5i - 6i + 3i =",-7,"-7","-7t",-8," - ","8","8i","-7t - 8i",null,"-7t - 5i - 6i + 3t =",-4,"-4","-4t",-11," - ","11","11i","-4t - 11i",null,"-7t - 5i - 6t + 3i =","-13t - 2i"]
[73,116,"t",97,"a",1,1,"-","",2,1," - ","2",9,0," + ","9",null,7,0," + ","7",null,30,null,"-t - 2a + 9t + 7a =",8,"8","8t",5," + ","5","5a","8t + 5a",null,"-t - 2t + 9t + 7a =",6,"6","6t",7," + ","7","7a","6t + 7a",null,"-t - 2a + 9a + 7a =",-1,"-","-t",14," + ","14","14a","-t + 14a",null,"-t - 2a + 9a + 7t =",6,"6","6t",7," + ","7","7a","6t + 7a",null,"-t - 2a + 9a + 7t =","6t + 7a"]
[74,99,"c",115,"s",7,0,"","7",3,0," + ","3",9,0," + ","9",null,3,0," + ","3",null,20,null,"7c + 3s + 9c + 3s =",16,"16","16c",6," + ","6","6s","16c + 6s",null,"7c + 3c + 9c + 3s =",19,"19","19c",3," + ","3","3s","19c + 3s",null,"7c + 3s + 9s + 3s =",7,"7","7c",15," + ","15","15s","7c + 15s",null,"7c + 3s + 9s + 3c =",10,"10","10c",12," + ","12","12s","10c + 12s",null,"7c + 3s + 9s + 3s =","7c + 15s"]
[75,97,"a",108,"m",2,1,"-","2",4,0," + ","4",6,0," + ","6",null,3,1," - ","3",null,10,null,"-2a + 4m + 6a - 3m =",4,"4","4a",1," + ","","m","4a + m",null,"-2a + 4a + 6a - 3m =",8,"8","8a",-3," - ","3","3m","8a - 3m",null,"-2a + 4m + 6m - 3m =",-2,"-2","-2a",7," + ","7","7m","-2a + 7m",null,"-2a + 4m + 6m - 3a =",-5,"-5","-5a",10," + ","10","10m","-5a + 10m",null,"-2a + 4a + 6a - 3m =","8a - 3m"]