{"text_format":"1","workbook":"xlsx","n_sheets":3,"sheets":["Worksheet","Answers","Working"],"not_rendered":{"charts":0,"images":0,"macros":1,"external_links":0,"defined_names":0,"comments":0,"pivot_tables":0},"unopened":[],"bounds":{"document_bytes":16777216,"sheet_cells":100000,"rows_first":2000,"rows_last":500,"rows_between":2000,"halvings":0,"cell_chars":16384,"cell_head_chars":4096},"cells_cut":0,"cells_raw":0,"read":"whole","date_system":"1900"}

{"sheet":"Worksheet","index":0,"n_rows":28,"n_cols":8,"rows_kept":28,"cut":false,"hidden":false,"merged":[]}
[null,null,null,null,"DISTRIBUTIVE PROPERTY"]
[null,null,null,null,null,null,{"$f":"CONCATENATE(\"Worksheet \",Working!C1,Working!B1)","v":"Worksheet DP-386"}]
["Expand the following;"]
[{"$f":"CONCATENATE(Working!A3,\")\")","v":"1)"},{"$f":"CONCATENATE(Working!M3,Working!N3,\"(\",Working!Q3,Working!R3,Working!F3,Working!Z3,Working!AA3,,\") =\")","v":"8(5m - 6) ="},{"$f":"CONCATENATE(Working!A28,\")\")","v":"26)"},{"$f":"CONCATENATE(Working!M28,Working!N28,\"(\",Working!Q28,Working!R28,Working!F28,Working!Z28,Working!AA28,Working!J28,\") =\")","v":"-7(r + 4b) ="},{"$f":"CONCATENATE(Working!A53,\")\")","v":"51)"},{"$f":"CONCATENATE(Working!M53,Working!N53,Working!C53,\"(\",Working!Q53,Working!R53,Working!F53,Working!Z53,Working!AA53,Working!J53,\") =\")","v":"-5d(t - 2o) ="},{"$f":"CONCATENATE(Working!A78,\")\")","v":"76)"},{"$f":"CONCATENATE(Working!M78,Working!N78,Working!C78,\"(\",Working!Q78,Working!R78,Working!C78,Working!Z78,Working!AA78,\") =\")","v":"-6d(6d - 5) ="}]
[{"$f":"CONCATENATE(Working!A4,\")\")","v":"2)"},{"$f":"CONCATENATE(Working!M4,Working!N4,\"(\",Working!Q4,Working!R4,Working!F4,Working!Z4,Working!AA4,,\") =\")","v":"9(5v - 7) ="},{"$f":"CONCATENATE(Working!A29,\")\")","v":"27)"},{"$f":"CONCATENATE(Working!M29,Working!N29,\"(\",Working!Q29,Working!R29,Working!F29,Working!Z29,Working!AA29,Working!J29,\") =\")","v":"8(-9m - 7w) ="},{"$f":"CONCATENATE(Working!A54,\")\")","v":"52)"},{"$f":"CONCATENATE(Working!M54,Working!N54,Working!C54,\"(\",Working!Q54,Working!R54,Working!F54,Working!Z54,Working!AA54,Working!J54,\") =\")","v":"-3m(3p + 7e) ="},{"$f":"CONCATENATE(Working!A79,\")\")","v":"77)"},{"$f":"CONCATENATE(Working!M79,Working!N79,Working!C79,\"(\",Working!Q79,Working!R79,Working!C79,Working!Z79,Working!AA79,\") =\")","v":"5k(3k - 7) ="}]
[{"$f":"CONCATENATE(Working!A5,\")\")","v":"3)"},{"$f":"CONCATENATE(Working!M5,Working!N5,\"(\",Working!Q5,Working!R5,Working!F5,Working!Z5,Working!AA5,,\") =\")","v":"5(6f - 4) ="},{"$f":"CONCATENATE(Working!A30,\")\")","v":"28)"},{"$f":"CONCATENATE(Working!M30,Working!N30,\"(\",Working!Q30,Working!R30,Working!F30,Working!Z30,Working!AA30,Working!J30,\") =\")","v":"6(-5f - 7g) ="},{"$f":"CONCATENATE(Working!A55,\")\")","v":"53)"},{"$f":"CONCATENATE(Working!M55,Working!N55,Working!C55,\"(\",Working!Q55,Working!R55,Working!F55,Working!Z55,Working!AA55,Working!J55,\") =\")","v":"r(7q - 6k) ="},{"$f":"CONCATENATE(Working!A80,\")\")","v":"78)"},{"$f":"CONCATENATE(Working!M80,Working!N80,Working!C80,\"(\",Working!Q80,Working!R80,Working!C80,Working!Z80,Working!AA80,\") =\")","v":"4c(-c - 7) ="}]
[{"$f":"CONCATENATE(Working!A6,\")\")","v":"4)"},{"$f":"CONCATENATE(Working!M6,Working!N6,\"(\",Working!Q6,Working!R6,Working!F6,Working!Z6,Working!AA6,,\") =\")","v":"2(3f - 4) ="},{"$f":"CONCATENATE(Working!A31,\")\")","v":"29)"},{"$f":"CONCATENATE(Working!M31,Working!N31,\"(\",Working!Q31,Working!R31,Working!F31,Working!Z31,Working!AA31,Working!J31,\") =\")","v":"-4(-5s - 2r) ="},{"$f":"CONCATENATE(Working!A56,\")\")","v":"54)"},{"$f":"CONCATENATE(Working!M56,Working!N56,Working!C56,\"(\",Working!Q56,Working!R56,Working!F56,Working!Z56,Working!AA56,Working!J56,\") =\")","v":"-6c(-5b - 6d) ="},{"$f":"CONCATENATE(Working!A81,\")\")","v":"79)"},{"$f":"CONCATENATE(Working!M81,Working!N81,Working!C81,\"(\",Working!Q81,Working!R81,Working!C81,Working!Z81,Working!AA81,\") =\")","v":"3i(-9i - 2) ="}]
[{"$f":"CONCATENATE(Working!A7,\")\")","v":"5)"},{"$f":"CONCATENATE(Working!M7,Working!N7,\"(\",Working!Q7,Working!R7,Working!F7,Working!Z7,Working!AA7,,\") =\")","v":"9(6j + 7) ="},{"$f":"CONCATENATE(Working!A32,\")\")","v":"30)"},{"$f":"CONCATENATE(Working!M32,Working!N32,\"(\",Working!Q32,Working!R32,Working!F32,Working!Z32,Working!AA32,Working!J32,\") =\")","v":"-8(-8w - 3a) ="},{"$f":"CONCATENATE(Working!A57,\")\")","v":"55)"},{"$f":"CONCATENATE(Working!M57,Working!N57,Working!C57,\"(\",Working!Q57,Working!R57,Working!F57,Working!Z57,Working!AA57,Working!J57,\") =\")","v":"-g(5d + 4c) ="},{"$f":"CONCATENATE(Working!A82,\")\")","v":"80)"},{"$f":"CONCATENATE(Working!M82,Working!N82,Working!C82,\"(\",Working!Q82,Working!R82,Working!C82,Working!Z82,Working!AA82,\") =\")","v":"5d(7d - 3) ="}]
[{"$f":"CONCATENATE(Working!A8,\")\")","v":"6)"},{"$f":"CONCATENATE(Working!M8,Working!N8,\"(\",Working!Q8,Working!R8,Working!F8,Working!Z8,Working!AA8,,\") =\")","v":"2(4c + 1) ="},{"$f":"CONCATENATE(Working!A33,\")\")","v":"31)"},{"$f":"CONCATENATE(Working!M33,Working!N33,\"(\",Working!Q33,Working!R33,Working!F33,Working!Z33,Working!AA33,Working!J33,\") =\")","v":"6(-8q - 3r) ="},{"$f":"CONCATENATE(Working!A58,\")\")","v":"56)"},{"$f":"CONCATENATE(Working!M58,Working!N58,Working!C58,\"(\",Working!Q58,Working!R58,Working!F58,Working!Z58,Working!AA58,Working!J58,\") =\")","v":"-7w(3a + 5e) ="},{"$f":"CONCATENATE(Working!A83,\")\")","v":"81)"},{"$f":"CONCATENATE(Working!M83,Working!N83,Working!C83,\"(\",Working!Q83,Working!R83,Working!C83,Working!Z83,Working!AA83,\") =\")","v":"7k(-6k - 7) ="}]
[{"$f":"CONCATENATE(Working!A9,\")\")","v":"7)"},{"$f":"CONCATENATE(Working!M9,Working!N9,\"(\",Working!Q9,Working!R9,Working!F9,Working!Z9,Working!AA9,,\") =\")","v":"3(-2m - 5) ="},{"$f":"CONCATENATE(Working!A34,\")\")","v":"32)"},{"$f":"CONCATENATE(Working!M34,Working!N34,\"(\",Working!Q34,Working!R34,Working!F34,Working!Z34,Working!AA34,Working!J34,\") =\")","v":"2(r - 4q) ="},{"$f":"CONCATENATE(Working!A59,\")\")","v":"57)"},{"$f":"CONCATENATE(Working!M59,Working!N59,Working!C59,\"(\",Working!Q59,Working!R59,Working!F59,Working!Z59,Working!AA59,Working!J59,\") =\")","v":"-7e(-h - 5s) ="},{"$f":"CONCATENATE(Working!A84,\")\")","v":"82)"},{"$f":"CONCATENATE(Working!M84,Working!N84,Working!C84,\"(\",Working!Q84,Working!R84,Working!C84,Working!Z84,Working!AA84,\") =\")","v":"9w(-9w - 7) ="}]
[{"$f":"CONCATENATE(Working!A10,\")\")","v":"8)"},{"$f":"CONCATENATE(Working!M10,Working!N10,\"(\",Working!Q10,Working!R10,Working!F10,Working!Z10,Working!AA10,,\") =\")","v":"8(-9q - 4) ="},{"$f":"CONCATENATE(Working!A35,\")\")","v":"33)"},{"$f":"CONCATENATE(Working!M35,Working!N35,\"(\",Working!Q35,Working!R35,Working!F35,Working!Z35,Working!AA35,Working!J35,\") =\")","v":"-4(8d + w) ="},{"$f":"CONCATENATE(Working!A60,\")\")","v":"58)"},{"$f":"CONCATENATE(Working!M60,Working!N60,Working!C60,\"(\",Working!Q60,Working!R60,Working!F60,Working!Z60,Working!AA60,Working!J60,\") =\")","v":"-2i(-5k + 3j) ="},{"$f":"CONCATENATE(Working!A85,\")\")","v":"83)"},{"$f":"CONCATENATE(Working!M85,Working!N85,Working!C85,\"(\",Working!Q85,Working!R85,Working!C85,Working!Z85,Working!AA85,\") =\")","v":"-o(-2o + 1) ="}]
[{"$f":"CONCATENATE(Working!A11,\")\")","v":"9)"},{"$f":"CONCATENATE(Working!M11,Working!N11,\"(\",Working!Q11,Working!R11,Working!F11,Working!Z11,Working!AA11,,\") =\")","v":"2(5i - 3) ="},{"$f":"CONCATENATE(Working!A36,\")\")","v":"34)"},{"$f":"CONCATENATE(Working!M36,Working!N36,\"(\",Working!Q36,Working!R36,Working!F36,Working!Z36,Working!AA36,Working!J36,\") =\")","v":"-9(8g - 7w) ="},{"$f":"CONCATENATE(Working!A61,\")\")","v":"59)"},{"$f":"CONCATENATE(Working!M61,Working!N61,Working!C61,\"(\",Working!Q61,Working!R61,Working!F61,Working!Z61,Working!AA61,Working!J61,\") =\")","v":"-2t(9x - 7i) ="},{"$f":"CONCATENATE(Working!A86,\")\")","v":"84)"},{"$f":"CONCATENATE(Working!M86,Working!N86,Working!C86,\"(\",Working!Q86,Working!R86,Working!C86,Working!Z86,Working!AA86,\") =\")","v":"-9q(2q + 1) ="}]
[{"$f":"CONCATENATE(Working!A12,\")\")","v":"10)"},{"$f":"CONCATENATE(Working!M12,Working!N12,\"(\",Working!Q12,Working!R12,Working!F12,Working!Z12,Working!AA12,,\") =\")","v":"6(5m + 6) ="},{"$f":"CONCATENATE(Working!A37,\")\")","v":"35)"},{"$f":"CONCATENATE(Working!M37,Working!N37,\"(\",Working!Q37,Working!R37,Working!F37,Working!Z37,Working!AA37,Working!J37,\") =\")","v":"-7(4a + 7u) ="},{"$f":"CONCATENATE(Working!A62,\")\")","v":"60)"},{"$f":"CONCATENATE(Working!M62,Working!N62,Working!C62,\"(\",Working!Q62,Working!R62,Working!F62,Working!Z62,Working!AA62,Working!J62,\") =\")","v":"9o(7t + 7s) ="},{"$f":"CONCATENATE(Working!A87,\")\")","v":"85)"},{"$f":"CONCATENATE(Working!M87,Working!N87,Working!C87,\"(\",Working!Q87,Working!R87,Working!C87,Working!Z87,Working!AA87,\") =\")","v":"8q(-5q + 1) ="}]
[{"$f":"CONCATENATE(Working!A13,\")\")","v":"11)"},{"$f":"CONCATENATE(Working!M13,Working!N13,\"(\",Working!Q13,Working!R13,Working!F13,Working!Z13,Working!AA13,,\") =\")","v":"-2(-5e + 7) ="},{"$f":"CONCATENATE(Working!A38,\")\")","v":"36)"},{"$f":"CONCATENATE(Working!M38,Working!N38,\"(\",Working!Q38,Working!R38,Working!F38,Working!Z38,Working!AA38,Working!J38,\") =\")","v":"-5(9a - k) ="},{"$f":"CONCATENATE(Working!A63,\")\")","v":"61)"},{"$f":"CONCATENATE(Working!M63,Working!N63,Working!C63,\"(\",Working!Q63,Working!R63,Working!F63,Working!Z63,Working!AA63,Working!J63,\") =\")","v":"-3d(8i + 3k) ="},{"$f":"CONCATENATE(Working!A88,\")\")","v":"86)"},{"$f":"CONCATENATE(Working!M88,Working!N88,Working!C88,\"(\",Working!Q88,Working!R88,Working!C88,Working!Z88,Working!AA88,Working!J88,\") =\")","v":"-9q(-6q - 7b) ="}]
[{"$f":"CONCATENATE(Working!A14,\")\")","v":"12)"},{"$f":"CONCATENATE(Working!M14,Working!N14,\"(\",Working!Q14,Working!R14,Working!F14,Working!Z14,Working!AA14,,\") =\")","v":"-5(9g + 7) ="},{"$f":"CONCATENATE(Working!A39,\")\")","v":"37)"},{"$f":"CONCATENATE(Working!M39,Working!N39,\"(\",Working!Q39,Working!R39,Working!F39,Working!Z39,Working!AA39,Working!J39,\") =\")","v":"-2(-5n - 3e) ="},{"$f":"CONCATENATE(Working!A64,\")\")","v":"62)"},{"$f":"CONCATENATE(Working!M64,Working!N64,Working!C64,\"(\",Working!Q64,Working!R64,Working!F64,Working!Z64,Working!AA64,Working!J64,\") =\")","v":"-5t(-6h - 4e) ="},{"$f":"CONCATENATE(Working!A89,\")\")","v":"87)"},{"$f":"CONCATENATE(Working!M89,Working!N89,Working!C89,\"(\",Working!Q89,Working!R89,Working!C89,Working!Z89,Working!AA89,Working!J89,\") =\")","v":"4u(-9u + 5c) ="}]
[{"$f":"CONCATENATE(Working!A15,\")\")","v":"13)"},{"$f":"CONCATENATE(Working!M15,Working!N15,\"(\",Working!Q15,Working!R15,Working!F15,Working!Z15,Working!AA15,,\") =\")","v":"-3(8k - 5) ="},{"$f":"CONCATENATE(Working!A40,\")\")","v":"38)"},{"$f":"CONCATENATE(Working!M40,Working!N40,\"(\",Working!Q40,Working!R40,Working!F40,Working!Z40,Working!AA40,Working!J40,\") =\")","v":"-2(6p - a) ="},{"$f":"CONCATENATE(Working!A65,\")\")","v":"63)"},{"$f":"CONCATENATE(Working!M65,Working!N65,Working!C65,\"(\",Working!Q65,Working!R65,Working!F65,Working!Z65,Working!AA65,Working!J65,\") =\")","v":"5o(-5f + 6j) ="},{"$f":"CONCATENATE(Working!A90,\")\")","v":"88)"},{"$f":"CONCATENATE(Working!M90,Working!N90,Working!C90,\"(\",Working!Q90,Working!R90,Working!C90,Working!Z90,Working!AA90,Working!J90,\") =\")","v":"9i(3i - j) ="}]
[{"$f":"CONCATENATE(Working!A16,\")\")","v":"14)"},{"$f":"CONCATENATE(Working!M16,Working!N16,\"(\",Working!Q16,Working!R16,Working!F16,Working!Z16,Working!AA16,,\") =\")","v":"-2(-3j - 7) ="},{"$f":"CONCATENATE(Working!A41,\")\")","v":"39)"},{"$f":"CONCATENATE(Working!M41,Working!N41,\"(\",Working!Q41,Working!R41,Working!F41,Working!Z41,Working!AA41,Working!J41,\") =\")","v":"2(-9n + 7g) ="},{"$f":"CONCATENATE(Working!A66,\")\")","v":"64)"},{"$f":"CONCATENATE(Working!M66,Working!N66,Working!C66,\"(\",Working!Q66,Working!R66,Working!F66,Working!Z66,Working!AA66,Working!J66,\") =\")","v":"7h(-8v - 5r) ="},{"$f":"CONCATENATE(Working!A91,\")\")","v":"89)"},{"$f":"CONCATENATE(Working!M91,Working!N91,Working!C91,\"(\",Working!Q91,Working!R91,Working!C91,Working!Z91,Working!AA91,Working!J91,\") =\")","v":"9b(-7b + 7d) ="}]
[{"$f":"CONCATENATE(Working!A17,\")\")","v":"15)"},{"$f":"CONCATENATE(Working!M17,Working!N17,\"(\",Working!Q17,Working!R17,Working!F17,Working!Z17,Working!AA17,,\") =\")","v":"-7(3k + 4) ="},{"$f":"CONCATENATE(Working!A42,\")\")","v":"40)"},{"$f":"CONCATENATE(Working!M42,Working!N42,\"(\",Working!Q42,Working!R42,Working!F42,Working!Z42,Working!AA42,Working!J42,\") =\")","v":"8(6r - 4q) ="},{"$f":"CONCATENATE(Working!A67,\")\")","v":"65)"},{"$f":"CONCATENATE(Working!M67,Working!N67,Working!C67,\"(\",Working!Q67,Working!R67,Working!F67,Working!Z67,Working!AA67,Working!J67,\") =\")","v":"4f(2k + 3m) ="},{"$f":"CONCATENATE(Working!A92,\")\")","v":"90)"},{"$f":"CONCATENATE(Working!M92,Working!N92,Working!C92,\"(\",Working!Q92,Working!R92,Working!C92,Working!Z92,Working!AA92,Working!J92,\") =\")","v":"-9a(-2a - 5x) ="}]
[{"$f":"CONCATENATE(Working!A18,\")\")","v":"16)"},{"$f":"CONCATENATE(Working!M18,Working!N18,\"(\",Working!Q18,Working!R18,Working!F18,Working!Z18,Working!AA18,,\") =\")","v":"-7(7m - 7) ="},{"$f":"CONCATENATE(Working!A43,\")\")","v":"41)"},{"$f":"CONCATENATE(Working!M43,Working!N43,\"(\",Working!Q43,Working!R43,Working!F43,Working!Z43,Working!AA43,Working!J43,\") =\")","v":"2(8d - 5n) ="},{"$f":"CONCATENATE(Working!A68,\")\")","v":"66)"},{"$f":"CONCATENATE(Working!M68,Working!N68,Working!C68,\"(\",Working!Q68,Working!R68,Working!F68,Working!Z68,Working!AA68,Working!J68,\") =\")","v":"6c(-3o - g) ="},{"$f":"CONCATENATE(Working!A93,\")\")","v":"91)"},{"$f":"CONCATENATE(Working!M93,Working!N93,Working!C93,\"(\",Working!Q93,Working!R93,Working!C93,Working!Z93,Working!AA93,Working!J93,\") =\")","v":"4g(7g - 2u) ="}]
[{"$f":"CONCATENATE(Working!A19,\")\")","v":"17)"},{"$f":"CONCATENATE(Working!M19,Working!N19,\"(\",Working!Q19,Working!R19,Working!F19,Working!Z19,Working!AA19,,\") =\")","v":"-2(6m - 7) ="},{"$f":"CONCATENATE(Working!A44,\")\")","v":"42)"},{"$f":"CONCATENATE(Working!M44,Working!N44,\"(\",Working!Q44,Working!R44,Working!F44,Working!Z44,Working!AA44,Working!J44,\") =\")","v":"5(b - 5x) ="},{"$f":"CONCATENATE(Working!A69,\")\")","v":"67)"},{"$f":"CONCATENATE(Working!M69,Working!N69,Working!C69,\"(\",Working!Q69,Working!R69,Working!F69,Working!Z69,Working!AA69,Working!J69,\") =\")","v":"a(e + 3j) ="},{"$f":"CONCATENATE(Working!A94,\")\")","v":"92)"},{"$f":"CONCATENATE(Working!M94,Working!N94,Working!C94,\"(\",Working!Q94,Working!R94,Working!C94,Working!Z94,Working!AA94,Working!J94,\") =\")","v":"-7j(6j + 4w) ="}]
[{"$f":"CONCATENATE(Working!A20,\")\")","v":"18)"},{"$f":"CONCATENATE(Working!M20,Working!N20,\"(\",Working!Q20,Working!R20,Working!F20,Working!Z20,Working!AA20,,\") =\")","v":"-2(8n + 3) ="},{"$f":"CONCATENATE(Working!A45,\")\")","v":"43)"},{"$f":"CONCATENATE(Working!M45,Working!N45,\"(\",Working!Q45,Working!R45,Working!F45,Working!Z45,Working!AA45,Working!J45,\") =\")","v":"-6(2r - 5m) ="},{"$f":"CONCATENATE(Working!A70,\")\")","v":"68)"},{"$f":"CONCATENATE(Working!M70,Working!N70,Working!C70,\"(\",Working!Q70,Working!R70,Working!F70,Working!Z70,Working!AA70,Working!J70,\") =\")","v":"4p(4s - 3h) ="},{"$f":"CONCATENATE(Working!A95,\")\")","v":"93)"},{"$f":"CONCATENATE(Working!M95,Working!N95,Working!C95,\"(\",Working!Q95,Working!R95,Working!C95,Working!Z95,Working!AA95,Working!J95,\") =\")","v":"9d(2d + 5w) ="}]
[{"$f":"CONCATENATE(Working!A21,\")\")","v":"19)"},{"$f":"CONCATENATE(Working!M21,Working!N21,\"(\",Working!Q21,Working!R21,Working!F21,Working!Z21,Working!AA21,,\") =\")","v":"-4(-7g - 5) ="},{"$f":"CONCATENATE(Working!A46,\")\")","v":"44)"},{"$f":"CONCATENATE(Working!M46,Working!N46,\"(\",Working!Q46,Working!R46,Working!F46,Working!Z46,Working!AA46,Working!J46,\") =\")","v":"-2(-7k - 3m) ="},{"$f":"CONCATENATE(Working!A71,\")\")","v":"69)"},{"$f":"CONCATENATE(Working!M71,Working!N71,Working!C71,\"(\",Working!Q71,Working!R71,Working!F71,Working!Z71,Working!AA71,Working!J71,\") =\")","v":"-2u(-3m + 4c) ="},{"$f":"CONCATENATE(Working!A96,\")\")","v":"94)"},{"$f":"CONCATENATE(Working!M96,Working!N96,Working!C96,\"(\",Working!Q96,Working!R96,Working!C96,Working!Z96,Working!AA96,Working!J96,\") =\")","v":"-4s(6s + 7a) ="}]
[{"$f":"CONCATENATE(Working!A22,\")\")","v":"20)"},{"$f":"CONCATENATE(Working!M22,Working!N22,\"(\",Working!Q22,Working!R22,Working!F22,Working!Z22,Working!AA22,,\") =\")","v":"-2(-e + 1) ="},{"$f":"CONCATENATE(Working!A47,\")\")","v":"45)"},{"$f":"CONCATENATE(Working!M47,Working!N47,\"(\",Working!Q47,Working!R47,Working!F47,Working!Z47,Working!AA47,Working!J47,\") =\")","v":"-6(-7c - 4m) ="},{"$f":"CONCATENATE(Working!A72,\")\")","v":"70)"},{"$f":"CONCATENATE(Working!M72,Working!N72,Working!C72,\"(\",Working!Q72,Working!R72,Working!F72,Working!Z72,Working!AA72,Working!J72,\") =\")","v":"-7b(-4w - 7x) ="},{"$f":"CONCATENATE(Working!A97,\")\")","v":"95)"},{"$f":"CONCATENATE(Working!M97,Working!N97,Working!C97,\"(\",Working!Q97,Working!R97,Working!C97,Working!Z97,Working!AA97,Working!J97,\") =\")","v":"-8m(m - 6d) ="}]
[{"$f":"CONCATENATE(Working!A23,\")\")","v":"21)"},{"$f":"CONCATENATE(Working!M23,Working!N23,\"(\",Working!Q23,Working!R23,Working!F23,Working!Z23,Working!AA23,,\") =\")","v":"7(-8g + 7) ="},{"$f":"CONCATENATE(Working!A48,\")\")","v":"46)"},{"$f":"CONCATENATE(Working!M48,Working!N48,\"(\",Working!Q48,Working!R48,Working!F48,Working!Z48,Working!AA48,Working!J48,\") =\")","v":"7(8o - 5b) ="},{"$f":"CONCATENATE(Working!A73,\")\")","v":"71)"},{"$f":"CONCATENATE(Working!M73,Working!N73,Working!C73,\"(\",Working!Q73,Working!R73,Working!F73,Working!Z73,Working!AA73,Working!J73,\") =\")","v":"b(-6s - 5o) ="},{"$f":"CONCATENATE(Working!A98,\")\")","v":"96)"},{"$f":"CONCATENATE(Working!M98,Working!N98,Working!C98,\"(\",Working!Q98,Working!R98,Working!C98,Working!Z98,Working!AA98,Working!J98,\") =\")","v":"5i(6i + 7c) ="}]
[{"$f":"CONCATENATE(Working!A24,\")\")","v":"22)"},{"$f":"CONCATENATE(Working!M24,Working!N24,\"(\",Working!Q24,Working!R24,Working!F24,Working!Z24,Working!AA24,,\") =\")","v":"5(-3g + 1) ="},{"$f":"CONCATENATE(Working!A49,\")\")","v":"47)"},{"$f":"CONCATENATE(Working!M49,Working!N49,\"(\",Working!Q49,Working!R49,Working!F49,Working!Z49,Working!AA49,Working!J49,\") =\")","v":"-6(6d - 4h) ="},{"$f":"CONCATENATE(Working!A74,\")\")","v":"72)"},{"$f":"CONCATENATE(Working!M74,Working!N74,Working!C74,\"(\",Working!Q74,Working!R74,Working!F74,Working!Z74,Working!AA74,Working!J74,\") =\")","v":"-7b(3n - 7o) ="},{"$f":"CONCATENATE(Working!A99,\")\")","v":"97)"},{"$f":"CONCATENATE(Working!M99,Working!N99,Working!C99,\"(\",Working!Q99,Working!R99,Working!C99,Working!Z99,Working!AA99,Working!J99,\") =\")","v":"9i(-9i - 5m) ="}]
[{"$f":"CONCATENATE(Working!A25,\")\")","v":"23)"},{"$f":"CONCATENATE(Working!M25,Working!N25,\"(\",Working!Q25,Working!R25,Working!F25,Working!Z25,Working!AA25,,\") =\")","v":"2(3i - 4) ="},{"$f":"CONCATENATE(Working!A50,\")\")","v":"48)"},{"$f":"CONCATENATE(Working!M50,Working!N50,\"(\",Working!Q50,Working!R50,Working!F50,Working!Z50,Working!AA50,Working!J50,\") =\")","v":"4(4j - 3v) ="},{"$f":"CONCATENATE(Working!A75,\")\")","v":"73)"},{"$f":"CONCATENATE(Working!M75,Working!N75,Working!C75,\"(\",Working!Q75,Working!R75,Working!F75,Working!Z75,Working!AA75,Working!J75,\") =\")","v":"8j(-6m + 5t) ="},{"$f":"CONCATENATE(Working!A100,\")\")","v":"98)"},{"$f":"CONCATENATE(Working!M100,Working!N100,Working!C100,\"(\",Working!Q100,Working!R100,Working!C100,Working!Z100,Working!AA100,Working!J100,\") =\")","v":"5g(9g + 4i) ="}]
[{"$f":"CONCATENATE(Working!A26,\")\")","v":"24)"},{"$f":"CONCATENATE(Working!M26,Working!N26,\"(\",Working!Q26,Working!R26,Working!F26,Working!Z26,Working!AA26,,\") =\")","v":"-2(6o + 4) ="},{"$f":"CONCATENATE(Working!A51,\")\")","v":"49)"},{"$f":"CONCATENATE(Working!M51,Working!N51,\"(\",Working!Q51,Working!R51,Working!F51,Working!Z51,Working!AA51,Working!J51,\") =\")","v":"5(6w + n) ="},{"$f":"CONCATENATE(Working!A76,\")\")","v":"74)"},{"$f":"CONCATENATE(Working!M76,Working!N76,Working!C76,\"(\",Working!Q76,Working!R76,Working!F76,Working!Z76,Working!AA76,Working!J76,\") =\")","v":"-8j(9i - 4w) ="},{"$f":"CONCATENATE(Working!A101,\")\")","v":"99)"},{"$f":"CONCATENATE(Working!M101,Working!N101,Working!C101,\"(\",Working!Q101,Working!R101,Working!C101,Working!Z101,Working!AA101,Working!J101,\") =\")","v":"7g(g + 5w) ="}]
[{"$f":"CONCATENATE(Working!A27,\")\")","v":"25)"},{"$f":"CONCATENATE(Working!M27,Working!N27,\"(\",Working!Q27,Working!R27,Working!F27,Working!Z27,Working!AA27,,\") =\")","v":"-5(-6f - 7) ="},{"$f":"CONCATENATE(Working!A52,\")\")","v":"50)"},{"$f":"CONCATENATE(Working!M52,Working!N52,\"(\",Working!Q52,Working!R52,Working!F52,Working!Z52,Working!AA52,Working!J52,\") =\")","v":"9(d + 7i) ="},{"$f":"CONCATENATE(Working!A77,\")\")","v":"75)"},{"$f":"CONCATENATE(Working!M77,Working!N77,Working!C77,\"(\",Working!Q77,Working!R77,Working!F77,Working!Z77,Working!AA77,Working!J77,\") =\")","v":"2s(-w + r) ="},{"$f":"CONCATENATE(Working!A102,\")\")","v":"100)"},{"$f":"CONCATENATE(Working!M102,Working!N102,Working!C102,\"(\",Working!Q102,Working!R102,Working!C102,Working!Z102,Working!AA102,Working!J102,\") =\")","v":"-5c(c - q) ="}]

{"sheet":"Answers","index":1,"n_rows":28,"n_cols":8,"rows_kept":28,"cut":false,"hidden":false,"merged":[]}
[null,null,null,null,"DISTRIBUTIVE PROPERTY"]
[null,null,null,null,"Answers",null,{"$f":"CONCATENATE(\"Worksheet \",Working!C1,Working!B1)","v":"Worksheet DP-386"}]
["Expand the following;"]
[{"$f":"CONCATENATE(Working!A3,\")\")","v":"1)"},{"$f":"CONCATENATE(Working!AE3,Working!AD3,Working!F3,Working!AH3,Working!AG3)","v":"40m - 48"},{"$f":"CONCATENATE(Working!A28,\")\")","v":"26)"},{"$f":"CONCATENATE(Working!AE28,Working!AD28,Working!F28,Working!AH28,Working!AG28,Working!J28)","v":"-7r - 28b"},{"$f":"CONCATENATE(Working!A53,\")\")","v":"51)"},{"$f":"CONCATENATE(Working!AE53,Working!AD53,Working!C53,Working!F53,Working!AH53,Working!AG53,Working!C53,Working!J53)","v":"-5dt + 10do"},{"$f":"CONCATENATE(Working!A78,\")\")","v":"76)"},{"$f":"CONCATENATE(Working!AE78,Working!AD78,Working!C78,CHAR(178),Working!AH78,Working!AG78,Working!C78)","v":"-36d² + 30d"}]
[{"$f":"CONCATENATE(Working!A4,\")\")","v":"2)"},{"$f":"CONCATENATE(Working!AE4,Working!AD4,Working!F4,Working!AH4,Working!AG4)","v":"45v - 63"},{"$f":"CONCATENATE(Working!A29,\")\")","v":"27)"},{"$f":"CONCATENATE(Working!AE29,Working!AD29,Working!F29,Working!AH29,Working!AG29,Working!J29)","v":"-72m - 56w"},{"$f":"CONCATENATE(Working!A54,\")\")","v":"52)"},{"$f":"CONCATENATE(Working!AE54,Working!AD54,Working!C54,Working!F54,Working!AH54,Working!AG54,Working!C54,Working!J54)","v":"-9mp - 21me"},{"$f":"CONCATENATE(Working!A79,\")\")","v":"77)"},{"$f":"CONCATENATE(Working!AE79,Working!AD79,Working!C79,CHAR(178),Working!AH79,Working!AG79,Working!C79)","v":"15k² - 35k"}]
[{"$f":"CONCATENATE(Working!A5,\")\")","v":"3)"},{"$f":"CONCATENATE(Working!AE5,Working!AD5,Working!F5,Working!AH5,Working!AG5)","v":"30f - 20"},{"$f":"CONCATENATE(Working!A30,\")\")","v":"28)"},{"$f":"CONCATENATE(Working!AE30,Working!AD30,Working!F30,Working!AH30,Working!AG30,Working!J30)","v":"-30f - 42g"},{"$f":"CONCATENATE(Working!A55,\")\")","v":"53)"},{"$f":"CONCATENATE(Working!AE55,Working!AD55,Working!C55,Working!F55,Working!AH55,Working!AG55,Working!C55,Working!J55)","v":"7rq - 6rk"},{"$f":"CONCATENATE(Working!A80,\")\")","v":"78)"},{"$f":"CONCATENATE(Working!AE80,Working!AD80,Working!C80,CHAR(178),Working!AH80,Working!AG80,Working!C80)","v":"-4c² - 28c"}]
[{"$f":"CONCATENATE(Working!A6,\")\")","v":"4)"},{"$f":"CONCATENATE(Working!AE6,Working!AD6,Working!F6,Working!AH6,Working!AG6)","v":"6f - 8"},{"$f":"CONCATENATE(Working!A31,\")\")","v":"29)"},{"$f":"CONCATENATE(Working!AE31,Working!AD31,Working!F31,Working!AH31,Working!AG31,Working!J31)","v":"20s + 8r"},{"$f":"CONCATENATE(Working!A56,\")\")","v":"54)"},{"$f":"CONCATENATE(Working!AE56,Working!AD56,Working!C56,Working!F56,Working!AH56,Working!AG56,Working!C56,Working!J56)","v":"30cb + 36cd"},{"$f":"CONCATENATE(Working!A81,\")\")","v":"79)"},{"$f":"CONCATENATE(Working!AE81,Working!AD81,Working!C81,CHAR(178),Working!AH81,Working!AG81,Working!C81)","v":"-27i² - 6i"}]
[{"$f":"CONCATENATE(Working!A7,\")\")","v":"5)"},{"$f":"CONCATENATE(Working!AE7,Working!AD7,Working!F7,Working!AH7,Working!AG7)","v":"54j + 63"},{"$f":"CONCATENATE(Working!A32,\")\")","v":"30)"},{"$f":"CONCATENATE(Working!AE32,Working!AD32,Working!F32,Working!AH32,Working!AG32,Working!J32)","v":"64w + 24a"},{"$f":"CONCATENATE(Working!A57,\")\")","v":"55)"},{"$f":"CONCATENATE(Working!AE57,Working!AD57,Working!C57,Working!F57,Working!AH57,Working!AG57,Working!C57,Working!J57)","v":"-5gd - 4gc"},{"$f":"CONCATENATE(Working!A82,\")\")","v":"80)"},{"$f":"CONCATENATE(Working!AE82,Working!AD82,Working!C82,CHAR(178),Working!AH82,Working!AG82,Working!C82)","v":"35d² - 15d"}]
[{"$f":"CONCATENATE(Working!A8,\")\")","v":"6)"},{"$f":"CONCATENATE(Working!AE8,Working!AD8,Working!F8,Working!AH8,Working!AG8)","v":"8c + 2"},{"$f":"CONCATENATE(Working!A33,\")\")","v":"31)"},{"$f":"CONCATENATE(Working!AE33,Working!AD33,Working!F33,Working!AH33,Working!AG33,Working!J33)","v":"-48q - 18r"},{"$f":"CONCATENATE(Working!A58,\")\")","v":"56)"},{"$f":"CONCATENATE(Working!AE58,Working!AD58,Working!C58,Working!F58,Working!AH58,Working!AG58,Working!C58,Working!J58)","v":"-21wa - 35we"},{"$f":"CONCATENATE(Working!A83,\")\")","v":"81)"},{"$f":"CONCATENATE(Working!AE83,Working!AD83,Working!C83,CHAR(178),Working!AH83,Working!AG83,Working!C83)","v":"-42k² - 49k"}]
[{"$f":"CONCATENATE(Working!A9,\")\")","v":"7)"},{"$f":"CONCATENATE(Working!AE9,Working!AD9,Working!F9,Working!AH9,Working!AG9)","v":"-6m - 15"},{"$f":"CONCATENATE(Working!A34,\")\")","v":"32)"},{"$f":"CONCATENATE(Working!AE34,Working!AD34,Working!F34,Working!AH34,Working!AG34,Working!J34)","v":"2r - 8q"},{"$f":"CONCATENATE(Working!A59,\")\")","v":"57)"},{"$f":"CONCATENATE(Working!AE59,Working!AD59,Working!C59,Working!F59,Working!AH59,Working!AG59,Working!C59,Working!J59)","v":"7eh + 35es"},{"$f":"CONCATENATE(Working!A84,\")\")","v":"82)"},{"$f":"CONCATENATE(Working!AE84,Working!AD84,Working!C84,CHAR(178),Working!AH84,Working!AG84,Working!C84)","v":"-81w² - 63w"}]
[{"$f":"CONCATENATE(Working!A10,\")\")","v":"8)"},{"$f":"CONCATENATE(Working!AE10,Working!AD10,Working!F10,Working!AH10,Working!AG10)","v":"-72q - 32"},{"$f":"CONCATENATE(Working!A35,\")\")","v":"33)"},{"$f":"CONCATENATE(Working!AE35,Working!AD35,Working!F35,Working!AH35,Working!AG35,Working!J35)","v":"-32d - 4w"},{"$f":"CONCATENATE(Working!A60,\")\")","v":"58)"},{"$f":"CONCATENATE(Working!AE60,Working!AD60,Working!C60,Working!F60,Working!AH60,Working!AG60,Working!C60,Working!J60)","v":"10ik - 6ij"},{"$f":"CONCATENATE(Working!A85,\")\")","v":"83)"},{"$f":"CONCATENATE(Working!AE85,Working!AD85,Working!C85,CHAR(178),Working!AH85,Working!AG85,Working!C85)","v":"2o² - o"}]
[{"$f":"CONCATENATE(Working!A11,\")\")","v":"9)"},{"$f":"CONCATENATE(Working!AE11,Working!AD11,Working!F11,Working!AH11,Working!AG11)","v":"10i - 6"},{"$f":"CONCATENATE(Working!A36,\")\")","v":"34)"},{"$f":"CONCATENATE(Working!AE36,Working!AD36,Working!F36,Working!AH36,Working!AG36,Working!J36)","v":"-72g + 63w"},{"$f":"CONCATENATE(Working!A61,\")\")","v":"59)"},{"$f":"CONCATENATE(Working!AE61,Working!AD61,Working!C61,Working!F61,Working!AH61,Working!AG61,Working!C61,Working!J61)","v":"-18tx + 14ti"},{"$f":"CONCATENATE(Working!A86,\")\")","v":"84)"},{"$f":"CONCATENATE(Working!AE86,Working!AD86,Working!C86,CHAR(178),Working!AH86,Working!AG86,Working!C86)","v":"-18q² - 9q"}]
[{"$f":"CONCATENATE(Working!A12,\")\")","v":"10)"},{"$f":"CONCATENATE(Working!AE12,Working!AD12,Working!F12,Working!AH12,Working!AG12)","v":"30m + 36"},{"$f":"CONCATENATE(Working!A37,\")\")","v":"35)"},{"$f":"CONCATENATE(Working!AE37,Working!AD37,Working!F37,Working!AH37,Working!AG37,Working!J37)","v":"-28a - 49u"},{"$f":"CONCATENATE(Working!A62,\")\")","v":"60)"},{"$f":"CONCATENATE(Working!AE62,Working!AD62,Working!C62,Working!F62,Working!AH62,Working!AG62,Working!C62,Working!J62)","v":"63ot + 63os"},{"$f":"CONCATENATE(Working!A87,\")\")","v":"85)"},{"$f":"CONCATENATE(Working!AE87,Working!AD87,Working!C87,CHAR(178),Working!AH87,Working!AG87,Working!C87)","v":"-40q² + 8q"}]
[{"$f":"CONCATENATE(Working!A13,\")\")","v":"11)"},{"$f":"CONCATENATE(Working!AE13,Working!AD13,Working!F13,Working!AH13,Working!AG13)","v":"10e - 14"},{"$f":"CONCATENATE(Working!A38,\")\")","v":"36)"},{"$f":"CONCATENATE(Working!AE38,Working!AD38,Working!F38,Working!AH38,Working!AG38,Working!J38)","v":"-45a + 5k"},{"$f":"CONCATENATE(Working!A63,\")\")","v":"61)"},{"$f":"CONCATENATE(Working!AE63,Working!AD63,Working!C63,Working!F63,Working!AH63,Working!AG63,Working!C63,Working!J63)","v":"-24di - 9dk"},{"$f":"CONCATENATE(Working!A88,\")\")","v":"86)"},{"$f":"CONCATENATE(Working!AE88,Working!AD88,Working!C88,CHAR(178),Working!AH88,Working!AG88,Working!C88,Working!J88)","v":"54q² + 63qb"}]
[{"$f":"CONCATENATE(Working!A14,\")\")","v":"12)"},{"$f":"CONCATENATE(Working!AE14,Working!AD14,Working!F14,Working!AH14,Working!AG14)","v":"-45g - 35"},{"$f":"CONCATENATE(Working!A39,\")\")","v":"37)"},{"$f":"CONCATENATE(Working!AE39,Working!AD39,Working!F39,Working!AH39,Working!AG39,Working!J39)","v":"10n + 6e"},{"$f":"CONCATENATE(Working!A64,\")\")","v":"62)"},{"$f":"CONCATENATE(Working!AE64,Working!AD64,Working!C64,Working!F64,Working!AH64,Working!AG64,Working!C64,Working!J64)","v":"30th + 20te"},{"$f":"CONCATENATE(Working!A89,\")\")","v":"87)"},{"$f":"CONCATENATE(Working!AE89,Working!AD89,Working!C89,CHAR(178),Working!AH89,Working!AG89,Working!C89,Working!J89)","v":"-36u² + 20uc"}]
[{"$f":"CONCATENATE(Working!A15,\")\")","v":"13)"},{"$f":"CONCATENATE(Working!AE15,Working!AD15,Working!F15,Working!AH15,Working!AG15)","v":"-24k + 15"},{"$f":"CONCATENATE(Working!A40,\")\")","v":"38)"},{"$f":"CONCATENATE(Working!AE40,Working!AD40,Working!F40,Working!AH40,Working!AG40,Working!J40)","v":"-12p + 2a"},{"$f":"CONCATENATE(Working!A65,\")\")","v":"63)"},{"$f":"CONCATENATE(Working!AE65,Working!AD65,Working!C65,Working!F65,Working!AH65,Working!AG65,Working!C65,Working!J65)","v":"-25of + 30oj"},{"$f":"CONCATENATE(Working!A90,\")\")","v":"88)"},{"$f":"CONCATENATE(Working!AE90,Working!AD90,Working!C90,CHAR(178),Working!AH90,Working!AG90,Working!C90,Working!J90)","v":"27i² - 9ij"}]
[{"$f":"CONCATENATE(Working!A16,\")\")","v":"14)"},{"$f":"CONCATENATE(Working!AE16,Working!AD16,Working!F16,Working!AH16,Working!AG16)","v":"6j + 14"},{"$f":"CONCATENATE(Working!A41,\")\")","v":"39)"},{"$f":"CONCATENATE(Working!AE41,Working!AD41,Working!F41,Working!AH41,Working!AG41,Working!J41)","v":"-18n + 14g"},{"$f":"CONCATENATE(Working!A66,\")\")","v":"64)"},{"$f":"CONCATENATE(Working!AE66,Working!AD66,Working!C66,Working!F66,Working!AH66,Working!AG66,Working!C66,Working!J66)","v":"-56hv - 35hr"},{"$f":"CONCATENATE(Working!A91,\")\")","v":"89)"},{"$f":"CONCATENATE(Working!AE91,Working!AD91,Working!C91,CHAR(178),Working!AH91,Working!AG91,Working!C91,Working!J91)","v":"-63b² + 63bd"}]
[{"$f":"CONCATENATE(Working!A17,\")\")","v":"15)"},{"$f":"CONCATENATE(Working!AE17,Working!AD17,Working!F17,Working!AH17,Working!AG17)","v":"-21k - 28"},{"$f":"CONCATENATE(Working!A42,\")\")","v":"40)"},{"$f":"CONCATENATE(Working!AE42,Working!AD42,Working!F42,Working!AH42,Working!AG42,Working!J42)","v":"48r - 32q"},{"$f":"CONCATENATE(Working!A67,\")\")","v":"65)"},{"$f":"CONCATENATE(Working!AE67,Working!AD67,Working!C67,Working!F67,Working!AH67,Working!AG67,Working!C67,Working!J67)","v":"8fk + 12fm"},{"$f":"CONCATENATE(Working!A92,\")\")","v":"90)"},{"$f":"CONCATENATE(Working!AE92,Working!AD92,Working!C92,CHAR(178),Working!AH92,Working!AG92,Working!C92,Working!J92)","v":"18a² + 45ax"}]
[{"$f":"CONCATENATE(Working!A18,\")\")","v":"16)"},{"$f":"CONCATENATE(Working!AE18,Working!AD18,Working!F18,Working!AH18,Working!AG18)","v":"-49m + 49"},{"$f":"CONCATENATE(Working!A43,\")\")","v":"41)"},{"$f":"CONCATENATE(Working!AE43,Working!AD43,Working!F43,Working!AH43,Working!AG43,Working!J43)","v":"16d - 10n"},{"$f":"CONCATENATE(Working!A68,\")\")","v":"66)"},{"$f":"CONCATENATE(Working!AE68,Working!AD68,Working!C68,Working!F68,Working!AH68,Working!AG68,Working!C68,Working!J68)","v":"-18co - 6cg"},{"$f":"CONCATENATE(Working!A93,\")\")","v":"91)"},{"$f":"CONCATENATE(Working!AE93,Working!AD93,Working!C93,CHAR(178),Working!AH93,Working!AG93,Working!C93,Working!J93)","v":"28g² - 8gu"}]
[{"$f":"CONCATENATE(Working!A19,\")\")","v":"17)"},{"$f":"CONCATENATE(Working!AE19,Working!AD19,Working!F19,Working!AH19,Working!AG19)","v":"-12m + 14"},{"$f":"CONCATENATE(Working!A44,\")\")","v":"42)"},{"$f":"CONCATENATE(Working!AE44,Working!AD44,Working!F44,Working!AH44,Working!AG44,Working!J44)","v":"5b - 25x"},{"$f":"CONCATENATE(Working!A69,\")\")","v":"67)"},{"$f":"CONCATENATE(Working!AE69,Working!AD69,Working!C69,Working!F69,Working!AH69,Working!AG69,Working!C69,Working!J69)","v":"ae + 3aj"},{"$f":"CONCATENATE(Working!A94,\")\")","v":"92)"},{"$f":"CONCATENATE(Working!AE94,Working!AD94,Working!C94,CHAR(178),Working!AH94,Working!AG94,Working!C94,Working!J94)","v":"-42j² - 28jw"}]
[{"$f":"CONCATENATE(Working!A20,\")\")","v":"18)"},{"$f":"CONCATENATE(Working!AE20,Working!AD20,Working!F20,Working!AH20,Working!AG20)","v":"-16n - 6"},{"$f":"CONCATENATE(Working!A45,\")\")","v":"43)"},{"$f":"CONCATENATE(Working!AE45,Working!AD45,Working!F45,Working!AH45,Working!AG45,Working!J45)","v":"-12r + 30m"},{"$f":"CONCATENATE(Working!A70,\")\")","v":"68)"},{"$f":"CONCATENATE(Working!AE70,Working!AD70,Working!C70,Working!F70,Working!AH70,Working!AG70,Working!C70,Working!J70)","v":"16ps - 12ph"},{"$f":"CONCATENATE(Working!A95,\")\")","v":"93)"},{"$f":"CONCATENATE(Working!AE95,Working!AD95,Working!C95,CHAR(178),Working!AH95,Working!AG95,Working!C95,Working!J95)","v":"18d² + 45dw"}]
[{"$f":"CONCATENATE(Working!A21,\")\")","v":"19)"},{"$f":"CONCATENATE(Working!AE21,Working!AD21,Working!F21,Working!AH21,Working!AG21)","v":"28g + 20"},{"$f":"CONCATENATE(Working!A46,\")\")","v":"44)"},{"$f":"CONCATENATE(Working!AE46,Working!AD46,Working!F46,Working!AH46,Working!AG46,Working!J46)","v":"14k + 6m"},{"$f":"CONCATENATE(Working!A71,\")\")","v":"69)"},{"$f":"CONCATENATE(Working!AE71,Working!AD71,Working!C71,Working!F71,Working!AH71,Working!AG71,Working!C71,Working!J71)","v":"6um - 8uc"},{"$f":"CONCATENATE(Working!A96,\")\")","v":"94)"},{"$f":"CONCATENATE(Working!AE96,Working!AD96,Working!C96,CHAR(178),Working!AH96,Working!AG96,Working!C96,Working!J96)","v":"-24s² - 28sa"}]
[{"$f":"CONCATENATE(Working!A22,\")\")","v":"20)"},{"$f":"CONCATENATE(Working!AE22,Working!AD22,Working!F22,Working!AH22,Working!AG22)","v":"2e - 2"},{"$f":"CONCATENATE(Working!A47,\")\")","v":"45)"},{"$f":"CONCATENATE(Working!AE47,Working!AD47,Working!F47,Working!AH47,Working!AG47,Working!J47)","v":"42c + 24m"},{"$f":"CONCATENATE(Working!A72,\")\")","v":"70)"},{"$f":"CONCATENATE(Working!AE72,Working!AD72,Working!C72,Working!F72,Working!AH72,Working!AG72,Working!C72,Working!J72)","v":"28bw + 49bx"},{"$f":"CONCATENATE(Working!A97,\")\")","v":"95)"},{"$f":"CONCATENATE(Working!AE97,Working!AD97,Working!C97,CHAR(178),Working!AH97,Working!AG97,Working!C97,Working!J97)","v":"-8m² + 48md"}]
[{"$f":"CONCATENATE(Working!A23,\")\")","v":"21)"},{"$f":"CONCATENATE(Working!AE23,Working!AD23,Working!F23,Working!AH23,Working!AG23)","v":"-56g + 49"},{"$f":"CONCATENATE(Working!A48,\")\")","v":"46)"},{"$f":"CONCATENATE(Working!AE48,Working!AD48,Working!F48,Working!AH48,Working!AG48,Working!J48)","v":"56o - 35b"},{"$f":"CONCATENATE(Working!A73,\")\")","v":"71)"},{"$f":"CONCATENATE(Working!AE73,Working!AD73,Working!C73,Working!F73,Working!AH73,Working!AG73,Working!C73,Working!J73)","v":"-6bs - 5bo"},{"$f":"CONCATENATE(Working!A98,\")\")","v":"96)"},{"$f":"CONCATENATE(Working!AE98,Working!AD98,Working!C98,CHAR(178),Working!AH98,Working!AG98,Working!C98,Working!J98)","v":"30i² + 35ic"}]
[{"$f":"CONCATENATE(Working!A24,\")\")","v":"22)"},{"$f":"CONCATENATE(Working!AE24,Working!AD24,Working!F24,Working!AH24,Working!AG24)","v":"-15g + 5"},{"$f":"CONCATENATE(Working!A49,\")\")","v":"47)"},{"$f":"CONCATENATE(Working!AE49,Working!AD49,Working!F49,Working!AH49,Working!AG49,Working!J49)","v":"-36d + 24h"},{"$f":"CONCATENATE(Working!A74,\")\")","v":"72)"},{"$f":"CONCATENATE(Working!AE74,Working!AD74,Working!C74,Working!F74,Working!AH74,Working!AG74,Working!C74,Working!J74)","v":"-21bn + 49bo"},{"$f":"CONCATENATE(Working!A99,\")\")","v":"97)"},{"$f":"CONCATENATE(Working!AE99,Working!AD99,Working!C99,CHAR(178),Working!AH99,Working!AG99,Working!C99,Working!J99)","v":"-81i² - 45im"}]
[{"$f":"CONCATENATE(Working!A25,\")\")","v":"23)"},{"$f":"CONCATENATE(Working!AE25,Working!AD25,Working!F25,Working!AH25,Working!AG25)","v":"6i - 8"},{"$f":"CONCATENATE(Working!A50,\")\")","v":"48)"},{"$f":"CONCATENATE(Working!AE50,Working!AD50,Working!F50,Working!AH50,Working!AG50,Working!J50)","v":"16j - 12v"},{"$f":"CONCATENATE(Working!A75,\")\")","v":"73)"},{"$f":"CONCATENATE(Working!AE75,Working!AD75,Working!C75,Working!F75,Working!AH75,Working!AG75,Working!C75,Working!J75)","v":"-48jm + 40jt"},{"$f":"CONCATENATE(Working!A100,\")\")","v":"98)"},{"$f":"CONCATENATE(Working!AE100,Working!AD100,Working!C100,CHAR(178),Working!AH100,Working!AG100,Working!C100,Working!J100)","v":"45g² + 20gi"}]
[{"$f":"CONCATENATE(Working!A26,\")\")","v":"24)"},{"$f":"CONCATENATE(Working!AE26,Working!AD26,Working!F26,Working!AH26,Working!AG26)","v":"-12o - 8"},{"$f":"CONCATENATE(Working!A51,\")\")","v":"49)"},{"$f":"CONCATENATE(Working!AE51,Working!AD51,Working!F51,Working!AH51,Working!AG51,Working!J51)","v":"30w + 5n"},{"$f":"CONCATENATE(Working!A76,\")\")","v":"74)"},{"$f":"CONCATENATE(Working!AE76,Working!AD76,Working!C76,Working!F76,Working!AH76,Working!AG76,Working!C76,Working!J76)","v":"-72ji + 32jw"},{"$f":"CONCATENATE(Working!A101,\")\")","v":"99)"},{"$f":"CONCATENATE(Working!AE101,Working!AD101,Working!C101,CHAR(178),Working!AH101,Working!AG101,Working!C101,Working!J101)","v":"7g² + 35gw"}]
[{"$f":"CONCATENATE(Working!A27,\")\")","v":"25)"},{"$f":"CONCATENATE(Working!AE27,Working!AD27,Working!F27,Working!AH27,Working!AG27)","v":"30f + 35"},{"$f":"CONCATENATE(Working!A52,\")\")","v":"50)"},{"$f":"CONCATENATE(Working!AE52,Working!AD52,Working!F52,Working!AH52,Working!AG52,Working!J52)","v":"9d + 63i"},{"$f":"CONCATENATE(Working!A77,\")\")","v":"75)"},{"$f":"CONCATENATE(Working!AE77,Working!AD77,Working!C77,Working!F77,Working!AH77,Working!AG77,Working!C77,Working!J77)","v":"-2sw + 2sr"},{"$f":"CONCATENATE(Working!A102,\")\")","v":"100)"},{"$f":"CONCATENATE(Working!AE102,Working!AD102,Working!C102,CHAR(178),Working!AH102,Working!AG102,Working!C102,Working!J102)","v":"-5c² + 5cq"}]

{"sheet":"Working","index":2,"n_rows":102,"n_cols":34,"rows_kept":102,"cut":false,"hidden":true,"merged":[]}
[{"$f":"INT(900*RAND()+100)","v":386},{"$f":"TEXT(1,A1)","v":"386"},"DP-",0,null,"aX(bY+cZ)",null,null,null,null,null,null,null,null,null,null,null,null,null,null,null,null,null,null,null,null,{"$f":"IF(X1=1,\"\",TEXT(X1,X1))","v":""}]
[null,null,"X",null,null,"Y",null,null,null,"Z",null,null,null,"a",null,null,null,"b",null,null,null,null,null,null,null,null,"c"]
[1,{"$f":"INT(24*RAND()+97)","v":103},{"$f":"IF(B3=108,CHAR(B3+1),CHAR(B3))","v":"g"},{"$f":"INT(24*RAND()+97)","v":108},{"$f":"IF(D3=B3,D3+1,D3)","v":108},{"$f":"IF(E3=108,CHAR(E3+1),CHAR(E3))","v":"m"},{"$f":"INT(24*RAND()+97)","v":116},{"$f":"IF(G3=B3, G3+1,IF(G3=E3,G3+1,G3))","v":116},{"$f":"IF(H3=E3, H3+1,IF(H3=B3,H3+1,H3))","v":116},{"$f":"IF(I3=108,CHAR(I3+1),CHAR(I3))","v":"t"},{"$f":"INT(8*RAND()+2)","v":8},0,{"$f":"IF(L3=0,\"\",\"-\")","v":""},{"$f":"IF(K3=1,\"\",TEXT(K3,K3))","v":"8"},{"$f":"INT(9*RAND()+1)","v":5},0,{"$f":"IF(P3=0,\"\",\"-\")","v":""},{"$f":"IF(O3=1,\"\",TEXT(O3,O3))","v":"5"},{"$f":"INT(7*RAND()+1)","v":5},{"$f":"IF(S3=1,1,(IF(AND(INT(O3/2)=O3/2,INT(S3/2)=S3/2),S3+1,S3)))","v":5},{"$f":"IF(AND(INT(O3/3)=O3/3,INT(T3/3)=T3/3 ),T3+1,T3)","v":5},{"$f":"IF(AND(INT(O3/4)=O3/4,INT(U3/4)=U3/4 ),U3+1,U3)","v":5},{"$f":"IF(AND(INT(O3/5)=O3/5,INT(V3/5)=V3/5 ),V3+1,V3)","v":6},{"$f":"IF(AND(INT(O3/2)=O3/2,INT(W3/2)=W3/2 ),W3+1,W3)","v":6},{"$f":"INT(2*RAND())","v":1},{"$f":"IF(Y3=0,\" + \",\" - \")","v":" - "},{"$f":"TEXT(W3,W3)","v":"6"},null,{"$f":"K3*O3","v":40},{"$f":"IF(AC3=1,\"\",TEXT($D$1,AC3))","v":"40"},{"$f":"IF((L3+P3)=1,\"-\",\"\")","v":""},{"$f":"K3*W3","v":48},{"$f":"IF(AF3=1,\"\",TEXT($D$1,AF3))","v":"48"},{"$f":"IF((L3+Y3)=1,\" - \",\" + \")","v":" - "}]
[2,{"$f":"INT(24*RAND()+97)","v":97},{"$f":"IF(B4=108,CHAR(B4+1),CHAR(B4))","v":"a"},{"$f":"INT(24*RAND()+97)","v":118},{"$f":"IF(D4=B4,D4+1,D4)","v":118},{"$f":"IF(E4=108,CHAR(E4+1),CHAR(E4))","v":"v"},{"$f":"INT(24*RAND()+97)","v":113},{"$f":"IF(G4=B4, G4+1,IF(G4=E4,G4+1,G4))","v":113},{"$f":"IF(H4=E4, H4+1,IF(H4=B4,H4+1,H4))","v":113},{"$f":"IF(I4=108,CHAR(I4+1),CHAR(I4))","v":"q"},{"$f":"INT(8*RAND()+2)","v":9},0,"",{"$f":"IF(K4=1,\"\",TEXT(K4,K4))","v":"9"},5,0,{"$f":"IF(P4=0,\"\",\"-\")","v":""},{"$f":"IF(O4=1,\"\",TEXT(O4,O4))","v":"5"},{"$f":"INT(7*RAND()+1)","v":7},{"$f":"IF(S4=1,1,(IF(AND(INT(O4/2)=O4/2,INT(S4/2)=S4/2),S4+1,S4)))","v":7},{"$f":"IF(AND(INT(O4/3)=O4/3,INT(T4/3)=T4/3 ),T4+1,T4)","v":7},{"$f":"IF(AND(INT(O4/4)=O4/4,INT(U4/4)=U4/4 ),U4+1,U4)","v":7},{"$f":"IF(AND(INT(O4/5)=O4/5,INT(V4/5)=V4/5 ),V4+1,V4)","v":7},{"$f":"IF(AND(INT(O4/2)=O4/2,INT(W4/2)=W4/2 ),W4+1,W4)","v":7},1,{"$f":"IF(Y4=0,\" + \",\" - \")","v":" - "},{"$f":"TEXT(W4,W4)","v":"7"},null,{"$f":"K4*O4","v":45},{"$f":"IF(AC4=1,\"\",TEXT($D$1,AC4))","v":"45"},{"$f":"IF((L4+P4)=1,\"-\",\"\")","v":""},{"$f":"K4*W4","v":63},{"$f":"IF(AF4=1,\"\",TEXT($D$1,AF4))","v":"63"}," - "]
[3,103,"g",102,102,"f",119,119,119,"w",5,0,"","5",6,0,"","6",3,3,4,4,4,5,1," - ",{"$f":"TEXT(W5,W5)","v":"4"},null,30,"30","",20,"20"," - "]
[4,116,"t",102,102,"f",111,111,111,"o",2,0,"","2",3,0,"","3",3,3,4,4,4,4,1," - ","4",null,6,"6","",8,"8"," - "]
[5,116,"t",106,106,"j",115,115,115,"s",9,0,"","9",6,0,"","6",7,7,7,7,7,7,0," + ","7",null,54,"54","",63,"63"," + "]
[6,98,"b",99,99,"c",113,113,113,"q",2,0,"","2",4,{"$f":"INT(2*RAND())","v":0},"","4",1,1,1,1,1,1,0," + ","1",null,8,"8","",2,"2"," + "]
[7,104,"h",108,108,"m",105,105,105,"i",3,0,"","3",2,1,"-","2",4,5,5,5,5,5,1," - ","5",null,6,"6","-",15,"15"," - "]
[8,120,"x",113,113,"q",98,98,98,"b",8,0,"","8",9,1,"-","9",4,4,4,4,4,4,1," - ","4",null,72,"72","-",32,"32"," - "]
[9,108,"m",105,105,"i",97,97,97,"a",2,0,"","2",5,0,"","5",3,3,3,3,3,3,1," - ","3",null,10,"10","",6,"6"," - "]
[10,109,"m",108,108,"m",111,111,111,"o",6,0,"","6",5,0,"","5",5,5,5,5,6,6,0," + ","6",null,30,"30","",36,"36"," + "]
[11,120,"x",101,101,"e",113,113,113,"q",2,1,"-","2",5,1,"-","5",7,7,7,7,7,7,0," + ","7",null,10,"10","",14,"14"," - "]
[12,119,"w",103,103,"g",104,104,104,"h",5,1,"-","5",9,0,"","9",6,6,7,7,7,7,0," + ","7",null,45,"45","-",35,"35"," - "]
[13,104,"h",107,107,"k",119,119,119,"w",3,1,"-","3",8,0,"","8",5,5,5,5,5,5,1," - ","5",null,24,"24","-",15,"15"," + "]
[14,99,"c",106,106,"j",106,107,107,"k",2,1,"-","2",3,1,"-","3",6,6,7,7,7,7,1," - ","7",null,6,"6","",14,"14"," + "]
[15,110,"n",107,107,"k",99,99,99,"c",7,1,"-","7",3,0,"","3",4,4,4,4,4,4,0," + ","4",null,21,"21","-",28,"28"," - "]
[16,102,"f",109,109,"m",113,113,113,"q",7,1,"-","7",7,0,"","7",7,7,7,7,7,7,1," - ","7",null,49,"49","-",49,"49"," + "]
[17,103,"g",108,108,"m",104,104,104,"h",2,1,"-","2",6,0,"","6",7,7,7,7,7,7,1," - ","7",null,12,"12","-",14,"14"," + "]
[18,108,"m",110,110,"n",104,104,104,"h",2,1,"-","2",8,0,"","8",2,3,3,3,3,3,0," + ","3",null,16,"16","-",6,"6"," - "]
[19,110,"n",103,103,"g",102,102,102,"f",4,1,"-","4",7,1,"-","7",5,5,5,5,5,5,1," - ","5",null,28,"28","",20,"20"," + "]
[20,104,"h",101,101,"e",100,100,100,"d",2,1,"-","2",1,1,"-","",1,1,1,1,1,1,0," + ","1",null,2,"2","",2,"2"," - "]
[21,110,"n",103,103,"g",102,102,102,"f",7,{"$f":"INT(2*RAND())","v":0},"","7",8,1,"-","8",6,7,7,7,7,7,0," + ","7",null,56,"56","-",49,"49"," + "]
[22,117,"u",103,103,"g",103,104,104,"h",5,0,"","5",3,1,"-","3",1,1,1,1,1,1,0," + ","1",null,15,"15","-",5,"5"," + "]
[23,106,"j",105,105,"i",118,118,118,"v",2,0,"","2",3,0,"","3",4,4,4,4,4,4,1," - ","4",null,6,"6","",8,"8"," - "]
[24,118,"v",111,111,"o",110,110,110,"n",2,1,"-","2",6,0,"","6",3,3,4,4,4,5,0," + ","4",null,12,"12","-",8,"8"," - "]
[25,101,"e",102,102,"f",102,103,103,"g",5,1,"-","5",6,1,"-","6",6,7,7,7,7,7,1," - ","7",null,30,"30","",35,"35"," + "]
[26,115,"s",114,114,"r",98,98,98,"b",7,1,"-","7",1,0,"","",4,4,4,4,4,4,0," + ",{"$f":"IF(W28=1,\"\",TEXT(W28,W28))","v":"4"},null,7,"7","-",28,"28"," - "]
[27,107,"k",108,108,"m",119,119,119,"w",8,0,"","8",9,1,"-","9",7,7,7,7,7,7,1," - ",{"$f":"IF(W29=1,\"\",TEXT(W29,W29))","v":"7"},null,72,"72","-",56,"56"," - "]
[28,110,"n",102,102,"f",103,103,103,"g",6,0,"","6",5,1,"-","5",7,7,7,7,7,7,1," - ","7",null,30,"30","-",42,"42"," - "]
[29,100,"d",115,115,"s",114,114,114,"r",4,1,"-","4",5,1,"-","5",2,2,2,2,2,2,1," - ","2",null,20,"20","",8,"8"," + "]
[30,111,"o",119,119,"w",97,97,97,"a",8,1,"-","8",8,1,"-","8",3,3,3,3,3,3,1," - ","3",null,64,"64","",24,"24"," + "]
[31,98,"b",113,113,"q",113,114,114,"r",6,0,"","6",8,1,"-","8",2,3,3,3,3,3,1," - ","3",null,48,"48","-",18,"18"," - "]
[32,109,"m",114,114,"r",113,113,113,"q",2,0,"","2",1,0,"","",4,4,4,4,4,4,1," - ","4",null,2,"2","",8,"8"," - "]
[33,107,"k",100,100,"d",119,119,119,"w",4,1,{"$f":"IF(L35=0,\"\",\"-\")","v":"-"},"4",{"$f":"INT(9*RAND()+1)","v":8},0,"","8",1,1,1,1,1,1,{"$f":"INT(2*RAND())","v":0}," + ","",null,32,"32","-",4,"4",{"$f":"IF((L35+Y35)=1,\" - \",\" + \")","v":" - "}]
[34,100,"d",103,103,"g",119,119,119,"w",9,1,"-","9",8,0,"","8",7,7,7,7,7,7,1," - ","7",null,72,"72","-",63,"63"," + "]
[35,111,"o",97,97,"a",117,117,117,"u",7,1,"-","7",4,0,"","4",6,7,7,7,7,7,0," + ","7",null,28,"28","-",49,"49"," - "]
[36,106,"j",97,97,"a",107,107,107,"k",5,1,"-","5",9,0,"","9",1,1,1,1,1,1,1," - ","",null,45,"45","-",5,"5"," + "]
[37,120,"x",110,110,"n",101,101,101,"e",2,1,"-","2",5,1,"-","5",3,3,3,3,3,3,1," - ","3",null,10,"10","",6,"6"," + "]
[38,100,"d",112,112,"p",97,97,97,"a",2,1,"-","2",6,{"$f":"INT(2*RAND())","v":0},"","6",1,1,1,1,1,1,1," - ","",null,12,"12","-",2,"2"," + "]
[39,119,"w",110,110,"n",103,103,103,"g",2,0,"","2",9,1,"-","9",7,7,7,7,7,7,0," + ","7",null,18,"18","-",14,"14"," + "]
[40,112,"p",114,114,"r",112,113,113,"q",8,0,"","8",6,0,"","6",2,3,4,4,4,5,1," - ","4",null,48,"48","",32,"32"," - "]
[41,103,"g",100,100,"d",110,110,110,"n",2,0,"","2",8,0,"","8",5,5,5,5,5,5,1," - ","5",null,16,"16","",10,"10"," - "]
[42,114,"r",98,98,"b",120,120,120,"x",5,0,"","5",1,0,"","",5,5,5,5,5,5,1," - ","5",null,5,"5","",25,"25"," - "]
[43,107,"k",114,114,"r",108,108,108,"m",6,1,"-","6",2,0,"","2",4,5,5,5,5,5,1," - ","5",null,12,"12","-",30,"30"," + "]
[44,111,"o",107,107,"k",109,109,109,"m",2,1,"-","2",7,1,"-","7",3,3,3,3,3,3,1," - ","3",null,14,"14","",6,"6"," + "]
[45,114,"r",99,99,"c",108,108,108,"m",6,1,"-","6",7,1,"-","7",4,4,4,4,4,4,1," - ","4",null,42,"42","",24,"24"," + "]
[46,116,"t",111,111,"o",98,98,98,"b",7,0,"","7",8,0,"","8",4,5,5,5,5,5,1," - ","5",null,56,"56","",35,"35"," - "]
[47,107,"k",100,100,"d",104,104,104,"h",6,1,"-","6",6,0,"","6",2,3,4,4,4,5,1," - ","4",null,36,"36","-",24,"24"," + "]
[48,116,"t",106,106,"j",118,118,118,"v",4,0,"","4",4,0,"","4",3,3,3,3,3,3,1," - ","3",null,16,"16","",12,"12"," - "]
[49,112,"p",119,119,"w",110,110,110,"n",5,0,"","5",6,0,"","6",1,1,1,1,1,1,0," + ","",null,30,"30","",5,"5"," + "]
[50,102,"f",100,100,"d",105,105,105,"i",9,0,"","9",1,0,"","",7,7,7,7,7,7,0," + ","7",null,9,"9","",63,"63"," + "]
[51,100,"d",116,116,"t",111,111,111,"o",{"$f":"INT(9*RAND()+1)","v":5},1,"-","5",1,0,"","",2,2,2,2,2,2,1," - ","2",null,5,"5","-",10,"10"," + "]
[52,108,"m",112,112,"p",101,101,101,"e",3,1,"-","3",3,0,"","3",6,6,7,7,7,7,0," + ","7",null,9,"9","-",21,"21"," - "]
[53,114,"r",113,113,"q",107,107,107,"k",1,{"$f":"INT(2*RAND())","v":0},"","",7,0,"","7",6,6,6,6,6,6,1," - ","6",null,7,"7","",6,"6"," - "]
[54,99,"c",98,98,"b",98,99,100,"d",6,1,"-","6",5,1,"-","5",5,5,5,5,6,6,1," - ","6",null,30,"30","",36,"36"," + "]
[55,103,"g",100,100,"d",99,99,99,"c",1,1,"-","",5,0,"","5",4,4,4,4,4,4,0," + ","4",null,5,"5","-",4,"4"," - "]
[56,119,"w",97,97,"a",101,101,101,"e",7,1,"-","7",3,0,"","3",5,5,5,5,5,5,0," + ","5",null,21,"21","-",35,"35"," - "]
[57,101,"e",104,104,"h",115,115,115,"s",7,1,"-","7",1,1,"-","",5,5,5,5,5,5,1," - ","5",null,7,"7","",35,"35"," + "]
[58,105,"i",107,107,"k",105,106,106,"j",2,1,"-","2",5,1,"-","5",3,3,3,3,3,3,0," + ","3",null,10,"10","",6,"6"," - "]
[59,116,"t",120,120,"x",105,105,105,"i",2,1,"-","2",9,0,"","9",6,6,7,7,7,7,1," - ","7",null,18,"18","-",14,"14"," + "]
[60,111,"o",116,116,"t",115,115,115,"s",9,0,"","9",7,0,"","7",7,7,7,7,7,7,0," + ","7",null,63,"63","",63,"63"," + "]
[61,100,"d",105,105,"i",107,107,107,"k",3,1,"-","3",8,0,"","8",3,3,3,3,3,3,0," + ","3",null,24,"24","-",9,"9"," - "]
[62,116,"t",104,104,"h",101,101,101,"e",5,1,"-","5",6,1,"-","6",2,3,4,4,4,5,1," - ","4",null,30,"30","",20,"20"," + "]
[63,111,"o",102,102,"f",106,106,106,"j",5,0,"","5",5,1,"-","5",5,5,5,5,6,6,0," + ","6",null,25,"25","-",30,"30"," + "]
[64,104,"h",118,118,"v",114,114,114,"r",7,0,"","7",8,1,"-","8",4,5,5,5,5,5,1," - ","5",null,56,"56","-",35,"35"," - "]
[65,102,"f",107,107,"k",109,109,109,"m",4,0,{"$f":"IF(L67=0,\"\",\"-\")","v":""},"4",{"$f":"INT(9*RAND()+1)","v":2},0,"","2",3,3,3,3,3,3,{"$f":"INT(2*RAND())","v":0}," + ","3",null,8,"8","",12,"12",{"$f":"IF((L67+Y67)=1,\" - \",\" + \")","v":" + "}]
[66,{"$f":"INT(24*RAND()+97)","v":99},{"$f":"IF(B68=108,CHAR(B68+1),CHAR(B68))","v":"c"},{"$f":"INT(24*RAND()+97)","v":111},{"$f":"IF(D68=B68,D68+1,D68)","v":111},{"$f":"IF(E68=108,CHAR(E68+1),CHAR(E68))","v":"o"},{"$f":"INT(24*RAND()+97)","v":103},{"$f":"IF(G68=B68, G68+1,IF(G68=E68,G68+1,G68))","v":103},{"$f":"IF(H68=E68, H68+1,IF(H68=B68,H68+1,H68))","v":103},{"$f":"IF(I68=108,CHAR(I68+1),CHAR(I68))","v":"g"},6,0,"",{"$f":"IF(K68=1,\"\",TEXT(K68,K68))","v":"6"},3,1,{"$f":"IF(P68=0,\"\",\"-\")","v":"-"},{"$f":"IF(O68=1,\"\",TEXT(O68,O68))","v":"3"},{"$f":"INT(7*RAND()+1)","v":1},{"$f":"IF(S68=1,1,(IF(AND(INT(O68/2)=O68/2,INT(S68/2)=S68/2),S68+1,S68)))","v":1},{"$f":"IF(AND(INT(O68/3)=O68/3,INT(T68/3)=T68/3 ),T68+1,T68)","v":1},{"$f":"IF(AND(INT(O68/4)=O68/4,INT(U68/4)=U68/4 ),U68+1,U68)","v":1},{"$f":"IF(AND(INT(O68/5)=O68/5,INT(V68/5)=V68/5 ),V68+1,V68)","v":1},{"$f":"IF(AND(INT(O68/2)=O68/2,INT(W68/2)=W68/2 ),W68+1,W68)","v":1},1,{"$f":"IF(Y68=0,\" + \",\" - \")","v":" - "},"",null,{"$f":"K68*O68","v":18},{"$f":"IF(AC68=1,\"\",TEXT($D$1,AC68))","v":"18"},{"$f":"IF((L68+P68)=1,\"-\",\"\")","v":"-"},{"$f":"K68*W68","v":6},{"$f":"IF(AF68=1,\"\",TEXT($D$1,AF68))","v":"6"}," - "]
[67,97,"a",101,101,"e",106,106,106,"j",1,0,"","",1,0,"","",3,3,3,3,3,3,0," + ","3",null,1,"","",3,"3"," + "]
[68,112,"p",115,115,"s",104,104,104,"h",4,0,"","4",4,0,"","4",2,3,3,3,3,3,1," - ","3",null,16,"16","",12,"12"," - "]
[69,117,"u",108,108,"m",99,99,99,"c",2,1,"-","2",3,1,"-","3",4,4,4,4,4,4,0," + ","4",null,6,"6","",8,"8"," - "]
[70,98,"b",119,119,"w",120,120,120,"x",7,1,"-","7",4,{"$f":"INT(2*RAND())","v":1},"-","4",7,7,7,7,7,7,1," - ","7",null,28,"28","",49,"49"," + "]
[71,98,"b",115,115,"s",111,111,111,"o",1,0,"","",6,1,"-","6",5,5,5,5,5,5,1," - ","5",null,6,"6","-",5,"5"," - "]
[72,98,"b",110,110,"n",111,111,111,"o",7,1,"-","7",3,0,"","3",7,7,7,7,7,7,1," - ","7",null,21,"21","-",49,"49"," + "]
[73,106,"j",108,108,"m",116,116,116,"t",8,0,"","8",6,1,"-","6",5,5,5,5,5,5,0," + ","5",null,48,"48","-",40,"40"," + "]
[74,106,"j",105,105,"i",119,119,119,"w",8,1,"-","8",9,0,"","9",4,4,4,4,4,4,1," - ","4",null,72,"72","-",32,"32"," + "]
[75,115,"s",119,119,"w",114,114,114,"r",2,0,"","2",1,1,"-","",1,1,1,1,1,1,0," + ","",null,2,"2","-",2,"2"," + "]
[76,100,"d",120,120,"x",107,107,107,"k",6,1,"-",{"$f":"IF(K78=1,\"\",TEXT(K78,K78))","v":"6"},6,0,"",{"$f":"IF(O78=1,\"\",TEXT(O78,O78))","v":"6"},4,5,5,5,5,5,1," - ",{"$f":"TEXT(W78,W78)","v":"5"},null,36,"36","-",30,"30"," + "]
[77,107,"k",109,109,"m",119,119,119,"w",5,0,"","5",3,0,"","3",6,6,7,7,7,7,1," - ",{"$f":"TEXT(W79,W79)","v":"7"},null,15,"15","",35,"35"," - "]
[78,99,"c",117,117,"u",109,109,109,"m",4,0,"","4",1,1,"-","",7,7,7,7,7,7,1," - ","7",null,4,"4","-",28,"28"," - "]
[79,105,"i",114,114,"r",118,118,118,"v",3,0,"","3",9,1,"-","9",2,2,2,2,2,2,1," - ","2",null,27,"27","-",6,"6"," - "]
[80,100,"d",115,115,"s",117,117,117,"u",5,0,"","5",7,0,"","7",3,3,3,3,3,3,1," - ","3",null,35,"35","",15,"15"," - "]
[81,107,"k",101,101,"e",97,97,97,"a",7,0,"","7",6,1,"-","6",7,7,7,7,7,7,{"$f":"INT(2*RAND())","v":1}," - ","7",null,42,"42","-",49,"49"," - "]
[82,119,"w",100,100,"d",117,117,117,"u",{"$f":"INT(9*RAND()+1)","v":9},{"$f":"INT(2*RAND())","v":0},"","9",{"$f":"INT(9*RAND()+1)","v":9},{"$f":"INT(2*RAND())","v":1},"-","9",6,6,7,7,7,7,{"$f":"INT(2*RAND())","v":1}," - ","7",null,81,"81","-",63,"63"," - "]
[83,111,"o",99,99,"c",116,116,116,"t",1,1,"-","",2,1,"-","2",1,1,1,1,1,1,0," + ","1",null,2,"2","",1,""," - "]
[84,113,"q",112,112,"p",115,115,115,"s",9,1,"-","9",2,0,"","2",1,1,1,1,1,1,0," + ","1",null,18,"18","-",9,"9"," - "]
[85,113,"q",98,98,"b",118,118,118,"v",8,0,"","8",5,1,"-","5",1,1,1,1,1,1,0," + ","1",null,40,"40","-",8,"8"," + "]
[86,113,"q",107,107,"k",98,98,98,"b",9,1,"-","9",6,1,"-","6",6,7,7,7,7,7,1," - ",{"$f":"IF(W88=1,\"\",TEXT(W88,W88))","v":"7"},null,54,"54","",63,"63"," + "]
[87,117,"u",117,118,"v",99,99,99,"c",4,0,"","4",9,1,"-","9",5,5,5,5,5,5,0," + ","5",null,36,"36","-",20,"20"," + "]
[88,105,"i",103,103,"g",106,106,106,"j",9,0,"","9",3,0,"","3",1,1,1,1,1,1,1," - ","",null,27,"27","",9,"9"," - "]
[89,98,"b",107,107,"k",100,100,100,"d",9,0,"","9",7,1,"-","7",7,7,7,7,7,7,0," + ","7",null,63,"63","-",63,"63"," + "]
[90,97,"a",119,119,"w",119,120,120,"x",9,1,"-","9",2,1,"-","2",5,5,5,5,5,5,1," - ","5",null,18,"18","",45,"45"," + "]
[91,103,"g",107,107,"k",117,117,117,"u",4,0,"","4",7,0,"","7",2,2,2,2,2,2,1," - ","2",null,28,"28","",8,"8"," - "]
[92,106,"j",111,111,"o",119,119,119,"w",7,1,"-","7",6,0,"","6",3,3,4,4,4,5,0," + ","4",null,42,"42","-",28,"28"," - "]
[93,100,"d",120,120,"x",119,119,119,"w",9,0,"","9",2,0,"","2",4,5,5,5,5,5,0," + ","5",null,18,"18","",45,"45"," + "]
[94,115,"s",112,112,"p",97,97,97,"a",4,1,"-","4",6,0,"","6",7,7,7,7,7,7,0," + ","7",null,24,"24","-",28,"28"," - "]
[95,108,"m",114,114,"r",100,100,100,"d",8,1,"-","8",1,0,"","",6,6,6,6,6,6,1," - ","6",null,8,"8","-",48,"48"," + "]
[96,105,"i",105,106,"j",99,99,99,"c",5,0,"","5",6,0,"","6",6,7,7,7,7,7,0," + ","7",null,30,"30","",35,"35"," + "]
[97,105,"i",120,120,"x",109,109,109,"m",9,0,{"$f":"IF(L99=0,\"\",\"-\")","v":""},"9",9,1,"-","9",5,5,5,5,5,5,1," - ","5",null,81,"81","-",45,"45"," - "]
[98,103,"g",98,98,"b",105,105,105,"i",5,0,{"$f":"IF(L100=0,\"\",\"-\")","v":""},"5",9,0,"","9",4,4,4,4,4,4,0," + ","4",null,45,"45","",20,"20"," + "]
[99,103,"g",115,115,"s",119,119,119,"w",7,0,{"$f":"IF(L101=0,\"\",\"-\")","v":""},"7",1,0,"","",5,5,5,5,5,5,0," + ","5",null,7,"7","",35,"35"," + "]
[100,99,"c",109,109,"m",113,113,113,"q",5,1,{"$f":"IF(L102=0,\"\",\"-\")","v":"-"},"5",1,0,"","",1,1,1,1,1,1,1," - ","",null,5,"5","-",5,"5"," + "]