{"text_format":"1","workbook":"xlsx","n_sheets":4,"sheets":["Information","Worksheet","Answers","Working"],"not_rendered":{"charts":0,"images":0,"macros":1,"external_links":0,"defined_names":0,"comments":0,"pivot_tables":0},"unopened":[],"bounds":{"document_bytes":16777216,"sheet_cells":100000,"rows_first":2000,"rows_last":500,"rows_between":2000,"halvings":0,"cell_chars":16384,"cell_head_chars":4096},"cells_cut":0,"cells_raw":0,"read":"whole","date_system":"1900"}

{"sheet":"Information","index":0,"n_rows":17,"n_cols":6,"rows_kept":17,"cut":false,"hidden":false,"merged":[[3,5,7,6]]}
[null,null,null,"FACTORISATION"]
[null,null,null,"2 terms"]
[]
[null,null,null,null,null,"PRESS F9 for NEW WorkSheet"]
[]
[]
[]
[]
[]
[null,"NOTES"]
[null,"* Practise factorising algebraic expressions."]
[null,"* Addition gives an answer from 2 to 20 while subtraction in the inverse."]
[null,"* The questions have 3 terms"]
[null,"* Expression contain integers."]
[null,"* This WorkSheet will generate 75 questions at random."]
[null,"* It is possible that some questions do not comply with accepted algrebraic rules."]
[null,"  eg. Repeated pronumerals. In this case just recalculate."]

{"sheet":"Worksheet","index":1,"n_rows":28,"n_cols":8,"rows_kept":28,"cut":false,"hidden":false,"merged":[]}
[null,null,null,null,"FACTORISATION"]
[null,null,null,null,null,null,{"$f":"CONCATENATE(\"Worksheet \",Working!C1,Working!B1)","v":"Worksheet DP-617"}]
["Factorise the following;"]
[{"$f":"CONCATENATE(Working!A3,\")\")","v":"1)"},{"$f":"CONCATENATE(Working!AD3,Working!AC3,Working!F3,Working!AG3,Working!AF3)","v":"30p - 25"},{"$f":"CONCATENATE(Working!A28,\")\")","v":"26)"},{"$f":"CONCATENATE(Working!AD28,Working!AC28,Working!F28,Working!AG28,Working!AF28,Working!I28)","v":"12q - 30h"},{"$f":"CONCATENATE(Working!A53,\")\")","v":"51)"},{"$f":"CONCATENATE(Working!AD53,Working!AC53,Working!C53,Working!F53,Working!AG53,Working!AF53,Working!C53,Working!I53)","v":"-28bx + 24bq"},{"$f":"CONCATENATE(Working!A78,\")\")","v":"76)"},{"$f":"CONCATENATE(Working!AD78,Working!AC78,Working!C78,CHAR(178),Working!AG78,Working!AF78,Working!C78)","v":"-64r² + 24r"}]
[{"$f":"CONCATENATE(Working!A4,\")\")","v":"2)"},{"$f":"CONCATENATE(Working!AD4,Working!AC4,Working!F4,Working!AG4,Working!AF4)","v":"24h + 15"},{"$f":"CONCATENATE(Working!A29,\")\")","v":"27)"},{"$f":"CONCATENATE(Working!AD29,Working!AC29,Working!F29,Working!AG29,Working!AF29,Working!I29)","v":"-24n + 16o"},{"$f":"CONCATENATE(Working!A54,\")\")","v":"52)"},{"$f":"CONCATENATE(Working!AD54,Working!AC54,Working!C54,Working!F54,Working!AG54,Working!AF54,Working!C54,Working!I54)","v":"-49pv + 42pd"},{"$f":"CONCATENATE(Working!A79,\")\")","v":"77)"},{"$f":"CONCATENATE(Working!AD79,Working!AC79,Working!C79,CHAR(178),Working!AG79,Working!AF79,Working!C79)","v":"-56z² + 7z"}]
[{"$f":"CONCATENATE(Working!A5,\")\")","v":"3)"},{"$f":"CONCATENATE(Working!AD5,Working!AC5,Working!F5,Working!AG5,Working!AF5)","v":"64x - 40"},{"$f":"CONCATENATE(Working!A30,\")\")","v":"28)"},{"$f":"CONCATENATE(Working!AD30,Working!AC30,Working!F30,Working!AG30,Working!AF30,Working!I30)","v":"8m - 16f"},{"$f":"CONCATENATE(Working!A55,\")\")","v":"53)"},{"$f":"CONCATENATE(Working!AD55,Working!AC55,Working!C55,Working!F55,Working!AG55,Working!AF55,Working!C55,Working!I55)","v":"-32kd + 56kt"},{"$f":"CONCATENATE(Working!A80,\")\")","v":"78)"},{"$f":"CONCATENATE(Working!AD80,Working!AC80,Working!C80,CHAR(178),Working!AG80,Working!AF80,Working!C80)","v":"-8m² + 28m"}]
[{"$f":"CONCATENATE(Working!A6,\")\")","v":"4)"},{"$f":"CONCATENATE(Working!AD6,Working!AC6,Working!F6,Working!AG6,Working!AF6)","v":"4f + 14"},{"$f":"CONCATENATE(Working!A31,\")\")","v":"29)"},{"$f":"CONCATENATE(Working!AD31,Working!AC31,Working!F31,Working!AG31,Working!AF31,Working!I31)","v":"15i - 21t"},{"$f":"CONCATENATE(Working!A56,\")\")","v":"54)"},{"$f":"CONCATENATE(Working!AD56,Working!AC56,Working!C56,Working!F56,Working!AG56,Working!AF56,Working!C56,Working!I56)","v":"2xt + 12xf"},{"$f":"CONCATENATE(Working!A81,\")\")","v":"79)"},{"$f":"CONCATENATE(Working!AD81,Working!AC81,Working!C81,CHAR(178),Working!AG81,Working!AF81,Working!C81)","v":"-14r² + 21r"}]
[{"$f":"CONCATENATE(Working!A7,\")\")","v":"5)"},{"$f":"CONCATENATE(Working!AD7,Working!AC7,Working!F7,Working!AG7,Working!AF7)","v":"20g + 24"},{"$f":"CONCATENATE(Working!A32,\")\")","v":"30)"},{"$f":"CONCATENATE(Working!AD32,Working!AC32,Working!F32,Working!AG32,Working!AF32,Working!I32)","v":"-12j - 6c"},{"$f":"CONCATENATE(Working!A57,\")\")","v":"55)"},{"$f":"CONCATENATE(Working!AD57,Working!AC57,Working!C57,Working!F57,Working!AG57,Working!AF57,Working!C57,Working!I57)","v":"-32gw - 28gk"},{"$f":"CONCATENATE(Working!A82,\")\")","v":"80)"},{"$f":"CONCATENATE(Working!AD82,Working!AC82,Working!C82,CHAR(178),Working!AG82,Working!AF82,Working!C82)","v":"8n² - 5n"}]
[{"$f":"CONCATENATE(Working!A8,\")\")","v":"6)"},{"$f":"CONCATENATE(Working!AD8,Working!AC8,Working!F8,Working!AG8,Working!AF8)","v":"21m + 49"},{"$f":"CONCATENATE(Working!A33,\")\")","v":"31)"},{"$f":"CONCATENATE(Working!AD33,Working!AC33,Working!F33,Working!AG33,Working!AF33,Working!I33)","v":"10s + 15n"},{"$f":"CONCATENATE(Working!A58,\")\")","v":"56)"},{"$f":"CONCATENATE(Working!AD58,Working!AC58,Working!C58,Working!F58,Working!AG58,Working!AF58,Working!C58,Working!I58)","v":"18jm + 10ji"},{"$f":"CONCATENATE(Working!A83,\")\")","v":"81)"},{"$f":"CONCATENATE(Working!AD83,Working!AC83,Working!C83,CHAR(178),Working!AG83,Working!AF83,Working!C83)","v":"10q² + 2q"}]
[{"$f":"CONCATENATE(Working!A9,\")\")","v":"7)"},{"$f":"CONCATENATE(Working!AD9,Working!AC9,Working!F9,Working!AG9,Working!AF9)","v":"14k + 21"},{"$f":"CONCATENATE(Working!A34,\")\")","v":"32)"},{"$f":"CONCATENATE(Working!AD34,Working!AC34,Working!F34,Working!AG34,Working!AF34,Working!I34)","v":"-25m + 15i"},{"$f":"CONCATENATE(Working!A59,\")\")","v":"57)"},{"$f":"CONCATENATE(Working!AD59,Working!AC59,Working!C59,Working!F59,Working!AG59,Working!AF59,Working!C59,Working!I59)","v":"24xu + 30xt"},{"$f":"CONCATENATE(Working!A84,\")\")","v":"82)"},{"$f":"CONCATENATE(Working!AD84,Working!AC84,Working!C84,CHAR(178),Working!AG84,Working!AF84,Working!C84)","v":"7o² + 4o"}]
[{"$f":"CONCATENATE(Working!A10,\")\")","v":"8)"},{"$f":"CONCATENATE(Working!AD10,Working!AC10,Working!F10,Working!AG10,Working!AF10)","v":"49f + 28"},{"$f":"CONCATENATE(Working!A35,\")\")","v":"33)"},{"$f":"CONCATENATE(Working!AD35,Working!AC35,Working!F35,Working!AG35,Working!AF35,Working!I35)","v":"-16e - 56j"},{"$f":"CONCATENATE(Working!A60,\")\")","v":"58)"},{"$f":"CONCATENATE(Working!AD60,Working!AC60,Working!C60,Working!F60,Working!AG60,Working!AF60,Working!C60,Working!I60)","v":"56zw + 21zf"},{"$f":"CONCATENATE(Working!A85,\")\")","v":"83)"},{"$f":"CONCATENATE(Working!AD85,Working!AC85,Working!C85,CHAR(178),Working!AG85,Working!AF85,Working!C85)","v":"2b² + 6b"}]
[{"$f":"CONCATENATE(Working!A11,\")\")","v":"9)"},{"$f":"CONCATENATE(Working!AD11,Working!AC11,Working!F11,Working!AG11,Working!AF11)","v":"21h + 6"},{"$f":"CONCATENATE(Working!A36,\")\")","v":"34)"},{"$f":"CONCATENATE(Working!AD36,Working!AC36,Working!F36,Working!AG36,Working!AF36,Working!I36)","v":"12n - 9o"},{"$f":"CONCATENATE(Working!A61,\")\")","v":"59)"},{"$f":"CONCATENATE(Working!AD61,Working!AC61,Working!C61,Working!F61,Working!AG61,Working!AF61,Working!C61,Working!I61)","v":"2vm - ve"},{"$f":"CONCATENATE(Working!A86,\")\")","v":"84)"},{"$f":"CONCATENATE(Working!AD86,Working!AC86,Working!C86,CHAR(178),Working!AG86,Working!AF86,Working!C86)","v":"35v² - 14v"}]
[{"$f":"CONCATENATE(Working!A12,\")\")","v":"10)"},{"$f":"CONCATENATE(Working!AD12,Working!AC12,Working!F12,Working!AG12,Working!AF12)","v":"20w - 15"},{"$f":"CONCATENATE(Working!A37,\")\")","v":"35)"},{"$f":"CONCATENATE(Working!AD37,Working!AC37,Working!F37,Working!AG37,Working!AF37,Working!I37)","v":"9k - 9a"},{"$f":"CONCATENATE(Working!A62,\")\")","v":"60)"},{"$f":"CONCATENATE(Working!AD62,Working!AC62,Working!C62,Working!F62,Working!AG62,Working!AF62,Working!C62,Working!I62)","v":"6kn + 9kd"},{"$f":"CONCATENATE(Working!A87,\")\")","v":"85)"},{"$f":"CONCATENATE(Working!AD87,Working!AC87,Working!C87,CHAR(178),Working!AG87,Working!AF87,Working!C87)","v":"-64t² + 40t"}]
[{"$f":"CONCATENATE(Working!A13,\")\")","v":"11)"},{"$f":"CONCATENATE(Working!AD13,Working!AC13,Working!F13,Working!AG13,Working!AF13)","v":"-49h + 21"},{"$f":"CONCATENATE(Working!A38,\")\")","v":"36)"},{"$f":"CONCATENATE(Working!AD38,Working!AC38,Working!F38,Working!AG38,Working!AF38,Working!I38)","v":"24h - 20a"},{"$f":"CONCATENATE(Working!A63,\")\")","v":"61)"},{"$f":"CONCATENATE(Working!AD63,Working!AC63,Working!C63,Working!F63,Working!AG63,Working!AF63,Working!C63,Working!I63)","v":"4vm + 7vm"},{"$f":"CONCATENATE(Working!A88,\")\")","v":"86)"},{"$f":"CONCATENATE(Working!AD88,Working!AC88,Working!C88,CHAR(178),Working!AG88,Working!AF88,Working!C88,Working!I88)","v":"-45b² + 35bm"}]
[{"$f":"CONCATENATE(Working!A14,\")\")","v":"12)"},{"$f":"CONCATENATE(Working!AD14,Working!AC14,Working!F14,Working!AG14,Working!AF14)","v":"-16n + 8"},{"$f":"CONCATENATE(Working!A39,\")\")","v":"37)"},{"$f":"CONCATENATE(Working!AD39,Working!AC39,Working!F39,Working!AG39,Working!AF39,Working!I39)","v":"45m - 10w"},{"$f":"CONCATENATE(Working!A64,\")\")","v":"62)"},{"$f":"CONCATENATE(Working!AD64,Working!AC64,Working!C64,Working!F64,Working!AG64,Working!AF64,Working!C64,Working!I64)","v":"-18mh - 15mg"},{"$f":"CONCATENATE(Working!A89,\")\")","v":"87)"},{"$f":"CONCATENATE(Working!AD89,Working!AC89,Working!C89,CHAR(178),Working!AG89,Working!AF89,Working!C89,Working!I89)","v":"21i² - 28ib"}]
[{"$f":"CONCATENATE(Working!A15,\")\")","v":"13)"},{"$f":"CONCATENATE(Working!AD15,Working!AC15,Working!F15,Working!AG15,Working!AF15)","v":"-12i + 15"},{"$f":"CONCATENATE(Working!A40,\")\")","v":"38)"},{"$f":"CONCATENATE(Working!AD40,Working!AC40,Working!F40,Working!AG40,Working!AF40,Working!I40)","v":"8d + 32j"},{"$f":"CONCATENATE(Working!A65,\")\")","v":"63)"},{"$f":"CONCATENATE(Working!AD65,Working!AC65,Working!C65,Working!F65,Working!AG65,Working!AF65,Working!C65,Working!I65)","v":"-56uj + 48ut"},{"$f":"CONCATENATE(Working!A90,\")\")","v":"88)"},{"$f":"CONCATENATE(Working!AD90,Working!AC90,Working!C90,CHAR(178),Working!AG90,Working!AF90,Working!C90,Working!I90)","v":"-3z² + 6zi"}]
[{"$f":"CONCATENATE(Working!A16,\")\")","v":"14)"},{"$f":"CONCATENATE(Working!AD16,Working!AC16,Working!F16,Working!AG16,Working!AF16)","v":"-72x - 45"},{"$f":"CONCATENATE(Working!A41,\")\")","v":"39)"},{"$f":"CONCATENATE(Working!AD41,Working!AC41,Working!F41,Working!AG41,Working!AF41,Working!I41)","v":"-25s + 20b"},{"$f":"CONCATENATE(Working!A66,\")\")","v":"64)"},{"$f":"CONCATENATE(Working!AD66,Working!AC66,Working!C66,Working!F66,Working!AG66,Working!AF66,Working!C66,Working!I66)","v":"72wq - 16wf"},{"$f":"CONCATENATE(Working!A91,\")\")","v":"89)"},{"$f":"CONCATENATE(Working!AD91,Working!AC91,Working!C91,CHAR(178),Working!AG91,Working!AF91,Working!C91,Working!I91)","v":"25g² + 5gr"}]
[{"$f":"CONCATENATE(Working!A17,\")\")","v":"15)"},{"$f":"CONCATENATE(Working!AD17,Working!AC17,Working!F17,Working!AG17,Working!AF17)","v":"-56f + 35"},{"$f":"CONCATENATE(Working!A42,\")\")","v":"40)"},{"$f":"CONCATENATE(Working!AD42,Working!AC42,Working!F42,Working!AG42,Working!AF42,Working!I42)","v":"28t - 21j"},{"$f":"CONCATENATE(Working!A67,\")\")","v":"65)"},{"$f":"CONCATENATE(Working!AD67,Working!AC67,Working!C67,Working!F67,Working!AG67,Working!AF67,Working!C67,Working!I67)","v":"-9in - 21id"},{"$f":"CONCATENATE(Working!A92,\")\")","v":"90)"},{"$f":"CONCATENATE(Working!AD92,Working!AC92,Working!C92,CHAR(178),Working!AG92,Working!AF92,Working!C92,Working!I92)","v":"-3b² + 4bs"}]
[{"$f":"CONCATENATE(Working!A18,\")\")","v":"16)"},{"$f":"CONCATENATE(Working!AD18,Working!AC18,Working!F18,Working!AG18,Working!AF18)","v":"-45m + 54"},{"$f":"CONCATENATE(Working!A43,\")\")","v":"41)"},{"$f":"CONCATENATE(Working!AD43,Working!AC43,Working!F43,Working!AG43,Working!AF43,Working!I43)","v":"30s + 36d"},{"$f":"CONCATENATE(Working!A68,\")\")","v":"66)"},{"$f":"CONCATENATE(Working!AD68,Working!AC68,Working!C68,Working!F68,Working!AG68,Working!AF68,Working!C68,Working!I68)","v":"10tx - 25tq"},{"$f":"CONCATENATE(Working!A93,\")\")","v":"91)"},{"$f":"CONCATENATE(Working!AD93,Working!AC93,Working!C93,CHAR(178),Working!AG93,Working!AF93,Working!C93,Working!I93)","v":"30a² + 15ab"}]
[{"$f":"CONCATENATE(Working!A19,\")\")","v":"17)"},{"$f":"CONCATENATE(Working!AD19,Working!AC19,Working!F19,Working!AG19,Working!AF19)","v":"-20w - 25"},{"$f":"CONCATENATE(Working!A44,\")\")","v":"42)"},{"$f":"CONCATENATE(Working!AD44,Working!AC44,Working!F44,Working!AG44,Working!AF44,Working!I44)","v":"-18o - 12n"},{"$f":"CONCATENATE(Working!A69,\")\")","v":"67)"},{"$f":"CONCATENATE(Working!AD69,Working!AC69,Working!C69,Working!F69,Working!AG69,Working!AF69,Working!C69,Working!I69)","v":"-4pb - 10pr"},{"$f":"CONCATENATE(Working!A94,\")\")","v":"92)"},{"$f":"CONCATENATE(Working!AD94,Working!AC94,Working!C94,CHAR(178),Working!AG94,Working!AF94,Working!C94,Working!I94)","v":"-42v² + 35vj"}]
[{"$f":"CONCATENATE(Working!A20,\")\")","v":"18)"},{"$f":"CONCATENATE(Working!AD20,Working!AC20,Working!F20,Working!AG20,Working!AF20)","v":"-64e + 8"},{"$f":"CONCATENATE(Working!A45,\")\")","v":"43)"},{"$f":"CONCATENATE(Working!AD45,Working!AC45,Working!F45,Working!AG45,Working!AF45,Working!I45)","v":"-32q + 56u"},{"$f":"CONCATENATE(Working!A70,\")\")","v":"68)"},{"$f":"CONCATENATE(Working!AD70,Working!AC70,Working!C70,Working!F70,Working!AG70,Working!AF70,Working!C70,Working!I70)","v":"7bc - 4bj"},{"$f":"CONCATENATE(Working!A95,\")\")","v":"93)"},{"$f":"CONCATENATE(Working!AD95,Working!AC95,Working!C95,CHAR(178),Working!AG95,Working!AF95,Working!C95,Working!I95)","v":"-4o² - 20ov"}]
[{"$f":"CONCATENATE(Working!A21,\")\")","v":"19)"},{"$f":"CONCATENATE(Working!AD21,Working!AC21,Working!F21,Working!AG21,Working!AF21)","v":"-20r - 35"},{"$f":"CONCATENATE(Working!A46,\")\")","v":"44)"},{"$f":"CONCATENATE(Working!AD46,Working!AC46,Working!F46,Working!AG46,Working!AF46,Working!I46)","v":"56s + 49k"},{"$f":"CONCATENATE(Working!A71,\")\")","v":"69)"},{"$f":"CONCATENATE(Working!AD71,Working!AC71,Working!C71,Working!F71,Working!AG71,Working!AF71,Working!C71,Working!I71)","v":"45kw + 20kg"},{"$f":"CONCATENATE(Working!A96,\")\")","v":"94)"},{"$f":"CONCATENATE(Working!AD96,Working!AC96,Working!C96,CHAR(178),Working!AG96,Working!AF96,Working!C96,Working!I96)","v":"-12v² + 42vm"}]
[{"$f":"CONCATENATE(Working!A22,\")\")","v":"20)"},{"$f":"CONCATENATE(Working!AD22,Working!AC22,Working!F22,Working!AG22,Working!AF22)","v":"-36i - 42"},{"$f":"CONCATENATE(Working!A47,\")\")","v":"45)"},{"$f":"CONCATENATE(Working!AD47,Working!AC47,Working!F47,Working!AG47,Working!AF47,Working!I47)","v":"20b + 12g"},{"$f":"CONCATENATE(Working!A72,\")\")","v":"70)"},{"$f":"CONCATENATE(Working!AD72,Working!AC72,Working!C72,Working!F72,Working!AG72,Working!AF72,Working!C72,Working!I72)","v":"-45be - 54bp"},{"$f":"CONCATENATE(Working!A97,\")\")","v":"95)"},{"$f":"CONCATENATE(Working!AD97,Working!AC97,Working!C97,CHAR(178),Working!AG97,Working!AF97,Working!C97,Working!I97)","v":"-6s² - 42su"}]
[{"$f":"CONCATENATE(Working!A23,\")\")","v":"21)"},{"$f":"CONCATENATE(Working!AD23,Working!AC23,Working!F23,Working!AG23,Working!AF23)","v":"-14d - 4"},{"$f":"CONCATENATE(Working!A48,\")\")","v":"46)"},{"$f":"CONCATENATE(Working!AD48,Working!AC48,Working!F48,Working!AG48,Working!AF48,Working!I48)","v":"-3i - 12p"},{"$f":"CONCATENATE(Working!A73,\")\")","v":"71)"},{"$f":"CONCATENATE(Working!AD73,Working!AC73,Working!C73,Working!F73,Working!AG73,Working!AF73,Working!C73,Working!I73)","v":"49nm + 14ng"},{"$f":"CONCATENATE(Working!A98,\")\")","v":"96)"},{"$f":"CONCATENATE(Working!AD98,Working!AC98,Working!C98,CHAR(178),Working!AG98,Working!AF98,Working!C98,Working!I98)","v":"-15a² + 6ar"}]
[{"$f":"CONCATENATE(Working!A24,\")\")","v":"22)"},{"$f":"CONCATENATE(Working!AD24,Working!AC24,Working!F24,Working!AG24,Working!AF24)","v":"-40v - 32"},{"$f":"CONCATENATE(Working!A49,\")\")","v":"47)"},{"$f":"CONCATENATE(Working!AD49,Working!AC49,Working!F49,Working!AG49,Working!AF49,Working!I49)","v":"-40m + 15j"},{"$f":"CONCATENATE(Working!A74,\")\")","v":"72)"},{"$f":"CONCATENATE(Working!AD74,Working!AC74,Working!C74,Working!F74,Working!AG74,Working!AF74,Working!C74,Working!I74)","v":"-5ot + 2ou"},{"$f":"CONCATENATE(Working!A99,\")\")","v":"97)"},{"$f":"CONCATENATE(Working!AD99,Working!AC99,Working!C99,CHAR(178),Working!AG99,Working!AF99,Working!C99,Working!I99)","v":"15g² - 25gn"}]
[{"$f":"CONCATENATE(Working!A25,\")\")","v":"23)"},{"$f":"CONCATENATE(Working!AD25,Working!AC25,Working!F25,Working!AG25,Working!AF25)","v":"-12w + 42"},{"$f":"CONCATENATE(Working!A50,\")\")","v":"48)"},{"$f":"CONCATENATE(Working!AD50,Working!AC50,Working!F50,Working!AG50,Working!AF50,Working!I50)","v":"16n + 28g"},{"$f":"CONCATENATE(Working!A75,\")\")","v":"73)"},{"$f":"CONCATENATE(Working!AD75,Working!AC75,Working!C75,Working!F75,Working!AG75,Working!AF75,Working!C75,Working!I75)","v":"21zt + 21zp"},{"$f":"CONCATENATE(Working!A100,\")\")","v":"98)"},{"$f":"CONCATENATE(Working!AD100,Working!AC100,Working!C100,CHAR(178),Working!AG100,Working!AF100,Working!C100,Working!I100)","v":"21k² + 18kt"}]
[{"$f":"CONCATENATE(Working!A26,\")\")","v":"24)"},{"$f":"CONCATENATE(Working!AD26,Working!AC26,Working!F26,Working!AG26,Working!AF26)","v":"48t - 8"},{"$f":"CONCATENATE(Working!A51,\")\")","v":"49)"},{"$f":"CONCATENATE(Working!AD51,Working!AC51,Working!F51,Working!AG51,Working!AF51,Working!I51)","v":"-28a + 21p"},{"$f":"CONCATENATE(Working!A76,\")\")","v":"74)"},{"$f":"CONCATENATE(Working!AD76,Working!AC76,Working!C76,Working!F76,Working!AG76,Working!AF76,Working!C76,Working!I76)","v":"-36we - 8wq"},{"$f":"CONCATENATE(Working!A101,\")\")","v":"99)"},{"$f":"CONCATENATE(Working!AD101,Working!AC101,Working!C101,CHAR(178),Working!AG101,Working!AF101,Working!C101,Working!I101)","v":"24i² - 16ij"}]
[{"$f":"CONCATENATE(Working!A27,\")\")","v":"25)"},{"$f":"CONCATENATE(Working!AD27,Working!AC27,Working!F27,Working!AG27,Working!AF27)","v":"-42q - 35"},{"$f":"CONCATENATE(Working!A52,\")\")","v":"50)"},{"$f":"CONCATENATE(Working!AD52,Working!AC52,Working!F52,Working!AG52,Working!AF52,Working!I52)","v":"-27k + 36f"},{"$f":"CONCATENATE(Working!A77,\")\")","v":"75)"},{"$f":"CONCATENATE(Working!AD77,Working!AC77,Working!C77,Working!F77,Working!AG77,Working!AF77,Working!C77,Working!I77)","v":"24gx + 8gk"},{"$f":"CONCATENATE(Working!A102,\")\")","v":"100)"},{"$f":"CONCATENATE(Working!AD102,Working!AC102,Working!C102,CHAR(178),Working!AG102,Working!AF102,Working!C102,Working!I102)","v":"32w² + 40wf"}]

{"sheet":"Answers","index":2,"n_rows":28,"n_cols":8,"rows_kept":28,"cut":false,"hidden":false,"merged":[]}
[null,null,null,null,"FACTORISATION"]
[null,null,null,null,"Answers",null,{"$f":"CONCATENATE(\"Worksheet \",Working!C1,Working!B1)","v":"Worksheet DP-617"}]
["Expand the following;"]
[{"$f":"CONCATENATE(Working!A3,\")\")","v":"1)"},{"$f":"CONCATENATE(Working!L3,Working!M3,\"(\",Working!P3,Working!Q3,Working!F3,Working!Y3,Working!Z3,\")\")","v":"5(6p - 5)"},{"$f":"CONCATENATE(Working!A28,\")\")","v":"26)"},{"$f":"CONCATENATE(Working!L28,Working!M28,\"(\",Working!P28,Working!Q28,Working!F28,Working!Y28,Working!Z28,Working!I28,\")\")","v":"6(2q - 5h)"},{"$f":"CONCATENATE(Working!A53,\")\")","v":"51)"},{"$f":"CONCATENATE(Working!L53,Working!M53,Working!C53,\"(\",Working!P53,Working!Q53,Working!F53,Working!Y53,Working!Z53,Working!I53,\")\")","v":"-4b(7x - 6q)"},{"$f":"CONCATENATE(Working!A78,\")\")","v":"76)"},{"$f":"CONCATENATE(Working!L78,Working!M78,Working!C78,\"(\",Working!P78,Working!Q78,Working!C78,Working!Y78,Working!Z78,\")\")","v":"-8r(8r - 3)"}]
[{"$f":"CONCATENATE(Working!A4,\")\")","v":"2)"},{"$f":"CONCATENATE(Working!L4,Working!M4,\"(\",Working!P4,Working!Q4,Working!F4,Working!Y4,Working!Z4,\")\")","v":"3(8h + 5)"},{"$f":"CONCATENATE(Working!A29,\")\")","v":"27)"},{"$f":"CONCATENATE(Working!L29,Working!M29,\"(\",Working!P29,Working!Q29,Working!F29,Working!Y29,Working!Z29,Working!I29,\")\")","v":"-8(3n - 2o)"},{"$f":"CONCATENATE(Working!A54,\")\")","v":"52)"},{"$f":"CONCATENATE(Working!L54,Working!M54,Working!C54,\"(\",Working!P54,Working!Q54,Working!F54,Working!Y54,Working!Z54,Working!I54,\")\")","v":"-7p(7v - 6d)"},{"$f":"CONCATENATE(Working!A79,\")\")","v":"77)"},{"$f":"CONCATENATE(Working!L79,Working!M79,Working!C79,\"(\",Working!P79,Working!Q79,Working!C79,Working!Y79,Working!Z79,\")\")","v":"-7z(8z - 1)"}]
[{"$f":"CONCATENATE(Working!A5,\")\")","v":"3)"},{"$f":"CONCATENATE(Working!L5,Working!M5,\"(\",Working!P5,Working!Q5,Working!F5,Working!Y5,Working!Z5,\")\")","v":"8(8x - 5)"},{"$f":"CONCATENATE(Working!A30,\")\")","v":"28)"},{"$f":"CONCATENATE(Working!L30,Working!M30,\"(\",Working!P30,Working!Q30,Working!F30,Working!Y30,Working!Z30,Working!I30,\")\")","v":"8(m - 2f)"},{"$f":"CONCATENATE(Working!A55,\")\")","v":"53)"},{"$f":"CONCATENATE(Working!L55,Working!M55,Working!C55,\"(\",Working!P55,Working!Q55,Working!F55,Working!Y55,Working!Z55,Working!I55,\")\")","v":"-8k(4d - 7t)"},{"$f":"CONCATENATE(Working!A80,\")\")","v":"78)"},{"$f":"CONCATENATE(Working!L80,Working!M80,Working!C80,\"(\",Working!P80,Working!Q80,Working!C80,Working!Y80,Working!Z80,\")\")","v":"-4m(2m - 7)"}]
[{"$f":"CONCATENATE(Working!A6,\")\")","v":"4)"},{"$f":"CONCATENATE(Working!L6,Working!M6,\"(\",Working!P6,Working!Q6,Working!F6,Working!Y6,Working!Z6,\")\")","v":"2(2f + 7)"},{"$f":"CONCATENATE(Working!A31,\")\")","v":"29)"},{"$f":"CONCATENATE(Working!L31,Working!M31,\"(\",Working!P31,Working!Q31,Working!F31,Working!Y31,Working!Z31,Working!I31,\")\")","v":"3(5i - 7t)"},{"$f":"CONCATENATE(Working!A56,\")\")","v":"54)"},{"$f":"CONCATENATE(Working!L56,Working!M56,Working!C56,\"(\",Working!P56,Working!Q56,Working!F56,Working!Y56,Working!Z56,Working!I56,\")\")","v":"2x(t + 6f)"},{"$f":"CONCATENATE(Working!A81,\")\")","v":"79)"},{"$f":"CONCATENATE(Working!L81,Working!M81,Working!C81,\"(\",Working!P81,Working!Q81,Working!C81,Working!Y81,Working!Z81,\")\")","v":"-7r(2r - 3)"}]
[{"$f":"CONCATENATE(Working!A7,\")\")","v":"5)"},{"$f":"CONCATENATE(Working!L7,Working!M7,\"(\",Working!P7,Working!Q7,Working!F7,Working!Y7,Working!Z7,\")\")","v":"4(5g + 6)"},{"$f":"CONCATENATE(Working!A32,\")\")","v":"30)"},{"$f":"CONCATENATE(Working!L32,Working!M32,\"(\",Working!P32,Working!Q32,Working!F32,Working!Y32,Working!Z32,Working!I32,\")\")","v":"-2(6j + 3c)"},{"$f":"CONCATENATE(Working!A57,\")\")","v":"55)"},{"$f":"CONCATENATE(Working!L57,Working!M57,Working!C57,\"(\",Working!P57,Working!Q57,Working!F57,Working!Y57,Working!Z57,Working!I57,\")\")","v":"-4g(8w + 7k)"},{"$f":"CONCATENATE(Working!A82,\")\")","v":"80)"},{"$f":"CONCATENATE(Working!L82,Working!M82,Working!C82,\"(\",Working!P82,Working!Q82,Working!C82,Working!Y82,Working!Z82,\")\")","v":"n(8n - 5)"}]
[{"$f":"CONCATENATE(Working!A8,\")\")","v":"6)"},{"$f":"CONCATENATE(Working!L8,Working!M8,\"(\",Working!P8,Working!Q8,Working!F8,Working!Y8,Working!Z8,\")\")","v":"7(3m + 7)"},{"$f":"CONCATENATE(Working!A33,\")\")","v":"31)"},{"$f":"CONCATENATE(Working!L33,Working!M33,\"(\",Working!P33,Working!Q33,Working!F33,Working!Y33,Working!Z33,Working!I33,\")\")","v":"5(2s + 3n)"},{"$f":"CONCATENATE(Working!A58,\")\")","v":"56)"},{"$f":"CONCATENATE(Working!L58,Working!M58,Working!C58,\"(\",Working!P58,Working!Q58,Working!F58,Working!Y58,Working!Z58,Working!I58,\")\")","v":"2j(9m + 5i)"},{"$f":"CONCATENATE(Working!A83,\")\")","v":"81)"},{"$f":"CONCATENATE(Working!L83,Working!M83,Working!C83,\"(\",Working!P83,Working!Q83,Working!C83,Working!Y83,Working!Z83,\")\")","v":"2q(5q + 1)"}]
[{"$f":"CONCATENATE(Working!A9,\")\")","v":"7)"},{"$f":"CONCATENATE(Working!L9,Working!M9,\"(\",Working!P9,Working!Q9,Working!F9,Working!Y9,Working!Z9,\")\")","v":"7(2k + 3)"},{"$f":"CONCATENATE(Working!A34,\")\")","v":"32)"},{"$f":"CONCATENATE(Working!L34,Working!M34,\"(\",Working!P34,Working!Q34,Working!F34,Working!Y34,Working!Z34,Working!I34,\")\")","v":"-5(5m - 3i)"},{"$f":"CONCATENATE(Working!A59,\")\")","v":"57)"},{"$f":"CONCATENATE(Working!L59,Working!M59,Working!C59,\"(\",Working!P59,Working!Q59,Working!F59,Working!Y59,Working!Z59,Working!I59,\")\")","v":"6x(4u + 5t)"},{"$f":"CONCATENATE(Working!A84,\")\")","v":"82)"},{"$f":"CONCATENATE(Working!L84,Working!M84,Working!C84,\"(\",Working!P84,Working!Q84,Working!C84,Working!Y84,Working!Z84,\")\")","v":"o(7o + 4)"}]
[{"$f":"CONCATENATE(Working!A10,\")\")","v":"8)"},{"$f":"CONCATENATE(Working!L10,Working!M10,\"(\",Working!P10,Working!Q10,Working!F10,Working!Y10,Working!Z10,\")\")","v":"7(7f + 4)"},{"$f":"CONCATENATE(Working!A35,\")\")","v":"33)"},{"$f":"CONCATENATE(Working!L35,Working!M35,\"(\",Working!P35,Working!Q35,Working!F35,Working!Y35,Working!Z35,Working!I35,\")\")","v":"-8(2e + 7j)"},{"$f":"CONCATENATE(Working!A60,\")\")","v":"58)"},{"$f":"CONCATENATE(Working!L60,Working!M60,Working!C60,\"(\",Working!P60,Working!Q60,Working!F60,Working!Y60,Working!Z60,Working!I60,\")\")","v":"7z(8w + 3f)"},{"$f":"CONCATENATE(Working!A85,\")\")","v":"83)"},{"$f":"CONCATENATE(Working!L85,Working!M85,Working!C85,\"(\",Working!P85,Working!Q85,Working!C85,Working!Y85,Working!Z85,\")\")","v":"2b(b + 3)"}]
[{"$f":"CONCATENATE(Working!A11,\")\")","v":"9)"},{"$f":"CONCATENATE(Working!L11,Working!M11,\"(\",Working!P11,Working!Q11,Working!F11,Working!Y11,Working!Z11,\")\")","v":"3(7h + 2)"},{"$f":"CONCATENATE(Working!A36,\")\")","v":"34)"},{"$f":"CONCATENATE(Working!L36,Working!M36,\"(\",Working!P36,Working!Q36,Working!F36,Working!Y36,Working!Z36,Working!I36,\")\")","v":"3(4n - 3o)"},{"$f":"CONCATENATE(Working!A61,\")\")","v":"59)"},{"$f":"CONCATENATE(Working!L61,Working!M61,Working!C61,\"(\",Working!P61,Working!Q61,Working!F61,Working!Y61,Working!Z61,Working!I61,\")\")","v":"v(2m - e)"},{"$f":"CONCATENATE(Working!A86,\")\")","v":"84)"},{"$f":"CONCATENATE(Working!L86,Working!M86,Working!C86,\"(\",Working!P86,Working!Q86,Working!C86,Working!Y86,Working!Z86,\")\")","v":"7v(5v - 2)"}]
[{"$f":"CONCATENATE(Working!A12,\")\")","v":"10)"},{"$f":"CONCATENATE(Working!L12,Working!M12,\"(\",Working!P12,Working!Q12,Working!F12,Working!Y12,Working!Z12,\")\")","v":"5(4w - 3)"},{"$f":"CONCATENATE(Working!A37,\")\")","v":"35)"},{"$f":"CONCATENATE(Working!L37,Working!M37,\"(\",Working!P37,Working!Q37,Working!F37,Working!Y37,Working!Z37,Working!I37,\")\")","v":"9(k - a)"},{"$f":"CONCATENATE(Working!A62,\")\")","v":"60)"},{"$f":"CONCATENATE(Working!L62,Working!M62,Working!C62,\"(\",Working!P62,Working!Q62,Working!F62,Working!Y62,Working!Z62,Working!I62,\")\")","v":"3k(2n + 3d)"},{"$f":"CONCATENATE(Working!A87,\")\")","v":"85)"},{"$f":"CONCATENATE(Working!L87,Working!M87,Working!C87,\"(\",Working!P87,Working!Q87,Working!C87,Working!Y87,Working!Z87,\")\")","v":"-8t(8t - 5)"}]
[{"$f":"CONCATENATE(Working!A13,\")\")","v":"11)"},{"$f":"CONCATENATE(Working!L13,Working!M13,\"(\",Working!P13,Working!Q13,Working!F13,Working!Y13,Working!Z13,\")\")","v":"-7(7h - 3)"},{"$f":"CONCATENATE(Working!A38,\")\")","v":"36)"},{"$f":"CONCATENATE(Working!L38,Working!M38,\"(\",Working!P38,Working!Q38,Working!F38,Working!Y38,Working!Z38,Working!I38,\")\")","v":"4(6h - 5a)"},{"$f":"CONCATENATE(Working!A63,\")\")","v":"61)"},{"$f":"CONCATENATE(Working!L63,Working!M63,Working!C63,\"(\",Working!P63,Working!Q63,Working!F63,Working!Y63,Working!Z63,Working!I63,\")\")","v":"v(4m + 7m)"},{"$f":"CONCATENATE(Working!A88,\")\")","v":"86)"},{"$f":"CONCATENATE(Working!L88,Working!M88,Working!C88,\"(\",Working!P88,Working!Q88,Working!C88,Working!Y88,Working!Z88,\")\")","v":"-5b(9b - 7)"}]
[{"$f":"CONCATENATE(Working!A14,\")\")","v":"12)"},{"$f":"CONCATENATE(Working!L14,Working!M14,\"(\",Working!P14,Working!Q14,Working!F14,Working!Y14,Working!Z14,\")\")","v":"-8(2n - 1)"},{"$f":"CONCATENATE(Working!A39,\")\")","v":"37)"},{"$f":"CONCATENATE(Working!L39,Working!M39,\"(\",Working!P39,Working!Q39,Working!F39,Working!Y39,Working!Z39,Working!I39,\")\")","v":"5(9m - 2w)"},{"$f":"CONCATENATE(Working!A64,\")\")","v":"62)"},{"$f":"CONCATENATE(Working!L64,Working!M64,Working!C64,\"(\",Working!P64,Working!Q64,Working!F64,Working!Y64,Working!Z64,Working!I64,\")\")","v":"-3m(6h + 5g)"},{"$f":"CONCATENATE(Working!A89,\")\")","v":"87)"},{"$f":"CONCATENATE(Working!L89,Working!M89,Working!C89,\"(\",Working!P89,Working!Q89,Working!C89,Working!Y89,Working!Z89,\")\")","v":"7i(3i - 4)"}]
[{"$f":"CONCATENATE(Working!A15,\")\")","v":"13)"},{"$f":"CONCATENATE(Working!L15,Working!M15,\"(\",Working!P15,Working!Q15,Working!F15,Working!Y15,Working!Z15,\")\")","v":"-3(4i - 5)"},{"$f":"CONCATENATE(Working!A40,\")\")","v":"38)"},{"$f":"CONCATENATE(Working!L40,Working!M40,\"(\",Working!P40,Working!Q40,Working!F40,Working!Y40,Working!Z40,Working!I40,\")\")","v":"8(d + 4j)"},{"$f":"CONCATENATE(Working!A65,\")\")","v":"63)"},{"$f":"CONCATENATE(Working!L65,Working!M65,Working!C65,\"(\",Working!P65,Working!Q65,Working!F65,Working!Y65,Working!Z65,Working!I65,\")\")","v":"-8u(7j - 6t)"},{"$f":"CONCATENATE(Working!A90,\")\")","v":"88)"},{"$f":"CONCATENATE(Working!L90,Working!M90,Working!C90,\"(\",Working!P90,Working!Q90,Working!C90,Working!Y90,Working!Z90,\")\")","v":"-3z(z - 2)"}]
[{"$f":"CONCATENATE(Working!A16,\")\")","v":"14)"},{"$f":"CONCATENATE(Working!L16,Working!M16,\"(\",Working!P16,Working!Q16,Working!F16,Working!Y16,Working!Z16,\")\")","v":"-9(8x + 5)"},{"$f":"CONCATENATE(Working!A41,\")\")","v":"39)"},{"$f":"CONCATENATE(Working!L41,Working!M41,\"(\",Working!P41,Working!Q41,Working!F41,Working!Y41,Working!Z41,Working!I41,\")\")","v":"-5(5s - 4b)"},{"$f":"CONCATENATE(Working!A66,\")\")","v":"64)"},{"$f":"CONCATENATE(Working!L66,Working!M66,Working!C66,\"(\",Working!P66,Working!Q66,Working!F66,Working!Y66,Working!Z66,Working!I66,\")\")","v":"8w(9q - 2f)"},{"$f":"CONCATENATE(Working!A91,\")\")","v":"89)"},{"$f":"CONCATENATE(Working!L91,Working!M91,Working!C91,\"(\",Working!P91,Working!Q91,Working!C91,Working!Y91,Working!Z91,\")\")","v":"5g(5g + )"}]
[{"$f":"CONCATENATE(Working!A17,\")\")","v":"15)"},{"$f":"CONCATENATE(Working!L17,Working!M17,\"(\",Working!P17,Working!Q17,Working!F17,Working!Y17,Working!Z17,\")\")","v":"-7(8f - 5)"},{"$f":"CONCATENATE(Working!A42,\")\")","v":"40)"},{"$f":"CONCATENATE(Working!L42,Working!M42,\"(\",Working!P42,Working!Q42,Working!F42,Working!Y42,Working!Z42,Working!I42,\")\")","v":"7(4t - 3j)"},{"$f":"CONCATENATE(Working!A67,\")\")","v":"65)"},{"$f":"CONCATENATE(Working!L67,Working!M67,Working!C67,\"(\",Working!P67,Working!Q67,Working!F67,Working!Y67,Working!Z67,Working!I67,\")\")","v":"-3i(3n + 7d)"},{"$f":"CONCATENATE(Working!A92,\")\")","v":"90)"},{"$f":"CONCATENATE(Working!L92,Working!M92,Working!C92,\"(\",Working!P92,Working!Q92,Working!C92,Working!Y92,Working!Z92,\")\")","v":"-b(3b - 4)"}]
[{"$f":"CONCATENATE(Working!A18,\")\")","v":"16)"},{"$f":"CONCATENATE(Working!L18,Working!M18,\"(\",Working!P18,Working!Q18,Working!F18,Working!Y18,Working!Z18,\")\")","v":"-9(5m - 6)"},{"$f":"CONCATENATE(Working!A43,\")\")","v":"41)"},{"$f":"CONCATENATE(Working!L43,Working!M43,\"(\",Working!P43,Working!Q43,Working!F43,Working!Y43,Working!Z43,Working!I43,\")\")","v":"6(5s + 6d)"},{"$f":"CONCATENATE(Working!A68,\")\")","v":"66)"},{"$f":"CONCATENATE(Working!L68,Working!M68,Working!C68,\"(\",Working!P68,Working!Q68,Working!F68,Working!Y68,Working!Z68,Working!I68,\")\")","v":"5t(2x - 5q)"},{"$f":"CONCATENATE(Working!A93,\")\")","v":"91)"},{"$f":"CONCATENATE(Working!L93,Working!M93,Working!C93,\"(\",Working!P93,Working!Q93,Working!C93,Working!Y93,Working!Z93,\")\")","v":"5a(6a + 3)"}]
[{"$f":"CONCATENATE(Working!A19,\")\")","v":"17)"},{"$f":"CONCATENATE(Working!L19,Working!M19,\"(\",Working!P19,Working!Q19,Working!F19,Working!Y19,Working!Z19,\")\")","v":"-5(4w + 5)"},{"$f":"CONCATENATE(Working!A44,\")\")","v":"42)"},{"$f":"CONCATENATE(Working!L44,Working!M44,\"(\",Working!P44,Working!Q44,Working!F44,Working!Y44,Working!Z44,Working!I44,\")\")","v":"-6(3o + 2n)"},{"$f":"CONCATENATE(Working!A69,\")\")","v":"67)"},{"$f":"CONCATENATE(Working!L69,Working!M69,Working!C69,\"(\",Working!P69,Working!Q69,Working!F69,Working!Y69,Working!Z69,Working!I69,\")\")","v":"-2p(2b + 5r)"},{"$f":"CONCATENATE(Working!A94,\")\")","v":"92)"},{"$f":"CONCATENATE(Working!L94,Working!M94,Working!C94,\"(\",Working!P94,Working!Q94,Working!C94,Working!Y94,Working!Z94,\")\")","v":"-7v(6v - 5)"}]
[{"$f":"CONCATENATE(Working!A20,\")\")","v":"18)"},{"$f":"CONCATENATE(Working!L20,Working!M20,\"(\",Working!P20,Working!Q20,Working!F20,Working!Y20,Working!Z20,\")\")","v":"-8(8e - 1)"},{"$f":"CONCATENATE(Working!A45,\")\")","v":"43)"},{"$f":"CONCATENATE(Working!L45,Working!M45,\"(\",Working!P45,Working!Q45,Working!F45,Working!Y45,Working!Z45,Working!I45,\")\")","v":"-8(4q - 7u)"},{"$f":"CONCATENATE(Working!A70,\")\")","v":"68)"},{"$f":"CONCATENATE(Working!L70,Working!M70,Working!C70,\"(\",Working!P70,Working!Q70,Working!F70,Working!Y70,Working!Z70,Working!I70,\")\")","v":"b(7c - 4j)"},{"$f":"CONCATENATE(Working!A95,\")\")","v":"93)"},{"$f":"CONCATENATE(Working!L95,Working!M95,Working!C95,\"(\",Working!P95,Working!Q95,Working!C95,Working!Y95,Working!Z95,\")\")","v":"-4o(o + 5)"}]
[{"$f":"CONCATENATE(Working!A21,\")\")","v":"19)"},{"$f":"CONCATENATE(Working!L21,Working!M21,\"(\",Working!P21,Working!Q21,Working!F21,Working!Y21,Working!Z21,\")\")","v":"-5(4r + 7)"},{"$f":"CONCATENATE(Working!A46,\")\")","v":"44)"},{"$f":"CONCATENATE(Working!L46,Working!M46,\"(\",Working!P46,Working!Q46,Working!F46,Working!Y46,Working!Z46,Working!I46,\")\")","v":"7(8s + 7k)"},{"$f":"CONCATENATE(Working!A71,\")\")","v":"69)"},{"$f":"CONCATENATE(Working!L71,Working!M71,Working!C71,\"(\",Working!P71,Working!Q71,Working!F71,Working!Y71,Working!Z71,Working!I71,\")\")","v":"5k(9w + 4g)"},{"$f":"CONCATENATE(Working!A96,\")\")","v":"94)"},{"$f":"CONCATENATE(Working!L96,Working!M96,Working!C96,\"(\",Working!P96,Working!Q96,Working!C96,Working!Y96,Working!Z96,\")\")","v":"-6v(2v - 7)"}]
[{"$f":"CONCATENATE(Working!A22,\")\")","v":"20)"},{"$f":"CONCATENATE(Working!L22,Working!M22,\"(\",Working!P22,Working!Q22,Working!F22,Working!Y22,Working!Z22,\")\")","v":"-6(6i + 7)"},{"$f":"CONCATENATE(Working!A47,\")\")","v":"45)"},{"$f":"CONCATENATE(Working!L47,Working!M47,\"(\",Working!P47,Working!Q47,Working!F47,Working!Y47,Working!Z47,Working!I47,\")\")","v":"4(5b + 3g)"},{"$f":"CONCATENATE(Working!A72,\")\")","v":"70)"},{"$f":"CONCATENATE(Working!L72,Working!M72,Working!C72,\"(\",Working!P72,Working!Q72,Working!F72,Working!Y72,Working!Z72,Working!I72,\")\")","v":"-9b(5e + 6p)"},{"$f":"CONCATENATE(Working!A97,\")\")","v":"95)"},{"$f":"CONCATENATE(Working!L97,Working!M97,Working!C97,\"(\",Working!P97,Working!Q97,Working!C97,Working!Y97,Working!Z97,\")\")","v":"-6s(s + 7)"}]
[{"$f":"CONCATENATE(Working!A23,\")\")","v":"21)"},{"$f":"CONCATENATE(Working!L23,Working!M23,\"(\",Working!P23,Working!Q23,Working!F23,Working!Y23,Working!Z23,\")\")","v":"-2(7d + 2)"},{"$f":"CONCATENATE(Working!A48,\")\")","v":"46)"},{"$f":"CONCATENATE(Working!L48,Working!M48,\"(\",Working!P48,Working!Q48,Working!F48,Working!Y48,Working!Z48,Working!I48,\")\")","v":"-3(i + 4p)"},{"$f":"CONCATENATE(Working!A73,\")\")","v":"71)"},{"$f":"CONCATENATE(Working!L73,Working!M73,Working!C73,\"(\",Working!P73,Working!Q73,Working!F73,Working!Y73,Working!Z73,Working!I73,\")\")","v":"7n(7m + 2g)"},{"$f":"CONCATENATE(Working!A98,\")\")","v":"96)"},{"$f":"CONCATENATE(Working!L98,Working!M98,Working!C98,\"(\",Working!P98,Working!Q98,Working!C98,Working!Y98,Working!Z98,\")\")","v":"-3a(5a - 2)"}]
[{"$f":"CONCATENATE(Working!A24,\")\")","v":"22)"},{"$f":"CONCATENATE(Working!L24,Working!M24,\"(\",Working!P24,Working!Q24,Working!F24,Working!Y24,Working!Z24,\")\")","v":"-8(5v + 4)"},{"$f":"CONCATENATE(Working!A49,\")\")","v":"47)"},{"$f":"CONCATENATE(Working!L49,Working!M49,\"(\",Working!P49,Working!Q49,Working!F49,Working!Y49,Working!Z49,Working!I49,\")\")","v":"-5(8m - 3j)"},{"$f":"CONCATENATE(Working!A74,\")\")","v":"72)"},{"$f":"CONCATENATE(Working!L74,Working!M74,Working!C74,\"(\",Working!P74,Working!Q74,Working!F74,Working!Y74,Working!Z74,Working!I74,\")\")","v":"-o(5t - 2u)"},{"$f":"CONCATENATE(Working!A99,\")\")","v":"97)"},{"$f":"CONCATENATE(Working!L99,Working!M99,Working!C99,\"(\",Working!P99,Working!Q99,Working!C99,Working!Y99,Working!Z99,\")\")","v":"5g(3g - 5)"}]
[{"$f":"CONCATENATE(Working!A25,\")\")","v":"23)"},{"$f":"CONCATENATE(Working!L25,Working!M25,\"(\",Working!P25,Working!Q25,Working!F25,Working!Y25,Working!Z25,\")\")","v":"-6(2w - 7)"},{"$f":"CONCATENATE(Working!A50,\")\")","v":"48)"},{"$f":"CONCATENATE(Working!L50,Working!M50,\"(\",Working!P50,Working!Q50,Working!F50,Working!Y50,Working!Z50,Working!I50,\")\")","v":"4(4n + 7g)"},{"$f":"CONCATENATE(Working!A75,\")\")","v":"73)"},{"$f":"CONCATENATE(Working!L75,Working!M75,Working!C75,\"(\",Working!P75,Working!Q75,Working!F75,Working!Y75,Working!Z75,Working!I75,\")\")","v":"3z(7t + 7p)"},{"$f":"CONCATENATE(Working!A100,\")\")","v":"98)"},{"$f":"CONCATENATE(Working!L100,Working!M100,Working!C100,\"(\",Working!P100,Working!Q100,Working!C100,Working!Y100,Working!Z100,\")\")","v":"3k(7k + 6)"}]
[{"$f":"CONCATENATE(Working!A26,\")\")","v":"24)"},{"$f":"CONCATENATE(Working!L26,Working!M26,\"(\",Working!P26,Working!Q26,Working!F26,Working!Y26,Working!Z26,\")\")","v":"8(6t - 1)"},{"$f":"CONCATENATE(Working!A51,\")\")","v":"49)"},{"$f":"CONCATENATE(Working!L51,Working!M51,\"(\",Working!P51,Working!Q51,Working!F51,Working!Y51,Working!Z51,Working!I51,\")\")","v":"-7(4a - 3p)"},{"$f":"CONCATENATE(Working!A76,\")\")","v":"74)"},{"$f":"CONCATENATE(Working!L76,Working!M76,Working!C76,\"(\",Working!P76,Working!Q76,Working!F76,Working!Y76,Working!Z76,Working!I76,\")\")","v":"-4w(9e + 2q)"},{"$f":"CONCATENATE(Working!A101,\")\")","v":"99)"},{"$f":"CONCATENATE(Working!L101,Working!M101,Working!C101,\"(\",Working!P101,Working!Q101,Working!C101,Working!Y101,Working!Z101,\")\")","v":"8i(3i - 2)"}]
[{"$f":"CONCATENATE(Working!A27,\")\")","v":"25)"},{"$f":"CONCATENATE(Working!L27,Working!M27,\"(\",Working!P27,Working!Q27,Working!F27,Working!Y27,Working!Z27,\")\")","v":"-7(6q + 5)"},{"$f":"CONCATENATE(Working!A52,\")\")","v":"50)"},{"$f":"CONCATENATE(Working!L52,Working!M52,\"(\",Working!P52,Working!Q52,Working!F52,Working!Y52,Working!Z52,Working!I52,\")\")","v":"-9(3k - 4f)"},{"$f":"CONCATENATE(Working!A77,\")\")","v":"75)"},{"$f":"CONCATENATE(Working!L77,Working!M77,Working!C77,\"(\",Working!P77,Working!Q77,Working!F77,Working!Y77,Working!Z77,Working!I77,\")\")","v":"8g(3x + k)"},{"$f":"CONCATENATE(Working!A102,\")\")","v":"100)"},{"$f":"CONCATENATE(Working!L102,Working!M102,Working!C102,\"(\",Working!P102,Working!Q102,Working!C102,Working!Y102,Working!Z102,\")\")","v":"8w(4w + 5)"}]

{"sheet":"Working","index":3,"n_rows":102,"n_cols":33,"rows_kept":102,"cut":false,"hidden":true,"merged":[]}
[{"$f":"INT(900*RAND()+100)","v":617},{"$f":"TEXT(1,A1)","v":"617"},"DP-",0,null,"aX(bY+cZ",null,{"$f":"CHAR(108)","v":"l"},null,null,null,null,null,null,null,null,null,null,null,null,null,null,null,null,null,{"$f":"IF(W1=1,\"\",TEXT(W1,W1))","v":""}]
[null,null,"X",null,null,"Y",null,null,"Z",null,null,null,"a",null,null,null,"b",null,null,null,null,null,null,null,null,"c"]
[1,{"$f":"RANDBETWEEN(97,122)","v":108},{"$f":"IF(B3=108,CHAR(B3+1),CHAR(B3))","v":"m"},{"$f":"RANDBETWEEN(97,120)","v":112},{"$f":"IF(D3=B3,D3+1,D3)","v":112},{"$f":"IF(E3=108,CHAR(E3+1),CHAR(E3))","v":"p"},{"$f":"RANDBETWEEN(97,119)","v":119},{"$f":"IF(OR(G3=B3,G3=E3),G3+1,G3)","v":119},{"$f":"IF(H3=108,CHAR(H3+1),CHAR(H3))","v":"w"},{"$f":"INT(8*RAND()+2)","v":5},0,{"$f":"IF(K3=0,\"\",\"-\")","v":""},{"$f":"IF(J3=1,\"\",TEXT(J3,J3))","v":"5"},{"$f":"INT(9*RAND()+1)","v":6},0,{"$f":"IF(O3=0,\"\",\"-\")","v":""},{"$f":"IF(N3=1,\"\",TEXT(N3,N3))","v":"6"},{"$f":"INT(7*RAND()+1)","v":4},{"$f":"IF(R3=1,1,(IF(AND(INT(N3/4)=N3/4,INT(R3/4)=R3/4),R3+1,R3)))","v":4},{"$f":"IF(AND(INT(N3/3)=N3/3,INT(S3/3)=S3/3 ),S3+1,S3)","v":4},{"$f":"IF(AND(INT(N3/2)=N3/2,INT(T3/2)=T3/2 ),T3+1,T3)","v":5},{"$f":"IF(AND(INT(N3/5)=N3/5,INT(U3/5)=U3/5 ),U3+1,U3)","v":5},{"$f":"IF(AND(INT(N3/2)=N3/2,INT(V3/2)=V3/2 ),V3+1,V3)","v":5},{"$f":"INT(2*RAND())","v":1},{"$f":"IF(X3=0,\" + \",\" - \")","v":" - "},{"$f":"TEXT(V3,V3)","v":"5"},null,{"$f":"J3*N3","v":30},{"$f":"IF(AB3=1,\"\",TEXT($D$1,AB3))","v":"30"},{"$f":"IF((K3+O3)=1,\"-\",\"\")","v":""},{"$f":"J3*V3","v":25},{"$f":"IF(AE3=1,\"\",TEXT($D$1,AE3))","v":"25"},{"$f":"IF((K3+X3)=1,\" - \",\" + \")","v":" - "}]
[2,{"$f":"RANDBETWEEN(97,122)","v":119},{"$f":"IF(B4=108,CHAR(B4+1),CHAR(B4))","v":"w"},{"$f":"RANDBETWEEN(97,120)","v":104},{"$f":"IF(D4=B4,D4+1,D4)","v":104},{"$f":"IF(E4=108,CHAR(E4+1),CHAR(E4))","v":"h"},{"$f":"RANDBETWEEN(97,119)","v":104},{"$f":"IF(OR(G4=B4,G4=E4),G4+1,G4)","v":105},{"$f":"IF(H4=108,CHAR(H4+1),CHAR(H4))","v":"i"},{"$f":"INT(8*RAND()+2)","v":3},0,"",{"$f":"IF(J4=1,\"\",TEXT(J4,J4))","v":"3"},8,0,{"$f":"IF(O4=0,\"\",\"-\")","v":""},{"$f":"IF(N4=1,\"\",TEXT(N4,N4))","v":"8"},{"$f":"INT(7*RAND()+1)","v":4},{"$f":"IF(R4=1,1,(IF(AND(INT(N4/4)=N4/4,INT(R4/4)=R4/4),R4+1,R4)))","v":5},{"$f":"IF(AND(INT(N4/3)=N4/3,INT(S4/3)=S4/3 ),S4+1,S4)","v":5},{"$f":"IF(AND(INT(N4/2)=N4/2,INT(T4/2)=T4/2 ),T4+1,T4)","v":5},{"$f":"IF(AND(INT(N4/5)=N4/5,INT(U4/5)=U4/5 ),U4+1,U4)","v":5},{"$f":"IF(AND(INT(N4/2)=N4/2,INT(V4/2)=V4/2 ),V4+1,V4)","v":5},0,{"$f":"IF(X4=0,\" + \",\" - \")","v":" + "},{"$f":"TEXT(V4,V4)","v":"5"},null,{"$f":"J4*N4","v":24},{"$f":"IF(AB4=1,\"\",TEXT($D$1,AB4))","v":"24"},{"$f":"IF((K4+O4)=1,\"-\",\"\")","v":""},{"$f":"J4*V4","v":15},{"$f":"IF(AE4=1,\"\",TEXT($D$1,AE4))","v":"15"}," + "]
[3,111,"o",120,120,"x",104,104,"h",8,0,"","8",8,0,"","8",5,5,5,5,5,5,1," - ",{"$f":"TEXT(V5,V5)","v":"5"},null,64,"64","",40,"40"," - "]
[4,109,"m",102,102,"f",111,111,"o",2,0,"","2",2,0,"","2",7,7,7,7,7,7,0," + ","7",null,4,"4","",14,"14"," + "]
[5,117,"u",103,103,"g",117,118,"v",4,0,"","4",5,0,"","5",6,6,6,6,6,6,0," + ","6",null,20,"20","",24,"24"," + "]
[6,99,"c",109,109,"m",111,111,"o",7,0,"","7",3,0,"","3",6,6,7,7,7,7,0," + ","7",null,21,"21","",49,"49"," + "]
[7,119,"w",107,107,"k",107,108,"m",7,0,"","7",2,0,"","2",3,3,3,3,3,3,0," + ","3",null,14,"14","",21,"21"," + "]
[8,104,"h",102,102,"f",116,116,"t",7,0,"","7",7,0,"","7",4,4,4,4,4,4,0," + ","4",null,49,"49","",28,"28"," + "]
[9,107,"k",104,104,"h",111,111,"o",3,0,"","3",7,0,"","7",2,2,2,2,2,2,0," + ","2",null,21,"21","",6,"6"," + "]
[10,105,"i",119,119,"w",116,116,"t",5,0,"","5",4,0,"","4",3,3,3,3,3,3,1," - ","3",null,20,"20","",15,"15"," - "]
[11,115,"s",104,104,"h",104,105,"i",7,1,"-","7",7,0,"","7",3,3,3,3,3,3,1," - ","3",null,49,"49","-",21,"21"," + "]
[12,100,"d",110,110,"n",104,104,"h",8,1,"-","8",2,0,"","2",1,1,1,1,1,1,1," - ","1",null,16,"16","-",8,"8"," + "]
[13,119,"w",105,105,"i",113,113,"q",3,1,"-","3",4,0,"","4",4,5,5,5,5,5,1," - ","5",null,12,"12","-",15,"15"," + "]
[14,115,"s",120,120,"x",99,99,"c",9,1,"-","9",8,0,"","8",5,5,5,5,5,5,0," + ","5",null,72,"72","-",45,"45"," - "]
[15,117,"u",102,102,"f",102,103,"g",7,1,"-","7",8,0,"","8",4,5,5,5,5,5,1," - ","5",null,56,"56","-",35,"35"," + "]
[16,98,"b",109,109,"m",114,114,"r",9,1,"-","9",5,0,"","5",6,6,6,6,6,6,1," - ","6",null,45,"45","-",54,"54"," + "]
[17,100,"d",119,119,"w",112,112,"p",5,1,"-","5",4,0,"","4",4,5,5,5,5,5,0," + ","5",null,20,"20","-",25,"25"," - "]
[18,110,"n",101,101,"e",99,99,"c",8,1,"-","8",8,0,"","8",1,1,1,1,1,1,1," - ","1",null,64,"64","-",8,"8"," + "]
[19,111,"o",114,114,"r",109,109,"m",5,1,"-","5",4,0,"","4",7,7,7,7,7,7,0," + ","7",null,20,"20","-",35,"35"," - "]
[20,104,"h",105,105,"i",98,98,"b",6,1,"-","6",6,0,"","6",7,7,7,7,7,7,0," + ","7",null,36,"36","-",42,"42"," - "]
[21,122,"z",100,100,"d",105,105,"i",2,{"$f":"INT(2*RAND())","v":1},"-","2",7,0,"","7",2,2,2,2,2,2,0," + ","2",null,14,"14","-",4,"4"," - "]
[22,112,"p",118,118,"v",97,97,"a",8,1,"-","8",5,0,"","5",4,4,4,4,4,4,0," + ","4",null,40,"40","-",32,"32"," - "]
[23,110,"n",119,119,"w",106,106,"j",6,1,"-","6",2,0,"","2",6,6,6,7,7,7,1," - ","7",null,12,"12","-",42,"42"," + "]
[24,109,"m",116,116,"t",118,118,"v",8,0,"","8",6,0,"","6",1,1,1,1,1,1,1," - ","1",null,48,"48","",8,"8"," - "]
[25,121,"y",113,113,"q",111,111,"o",7,1,"-","7",6,0,"","6",5,5,5,5,5,5,0," + ","5",null,42,"42","-",35,"35"," - "]
[26,120,"x",113,113,"q",104,104,"h",6,0,"","6",2,0,"","2",4,4,4,5,5,5,1," - ",{"$f":"IF(V28=1,\"\",TEXT(V28,V28))","v":"5"},null,12,"12","",30,"30"," - "]
[27,112,"p",110,110,"n",110,111,"o",8,1,"-","8",3,0,"","3",2,2,2,2,2,2,1," - ",{"$f":"IF(V29=1,\"\",TEXT(V29,V29))","v":"2"},null,24,"24","-",16,"16"," + "]
[28,107,"k",107,108,"m",102,102,"f",8,0,"","8",1,0,"","",2,2,2,2,2,2,1," - ","2",null,8,"8","",16,"16"," - "]
[29,117,"u",105,105,"i",116,116,"t",3,0,"","3",5,0,"","5",7,7,7,7,7,7,1," - ","7",null,15,"15","",21,"21"," - "]
[30,104,"h",106,106,"j",99,99,"c",2,1,"-","2",6,0,"","6",2,2,2,3,3,3,0," + ","3",null,12,"12","-",6,"6"," - "]
[31,101,"e",115,115,"s",110,110,"n",5,0,"","5",2,0,"","2",2,2,2,3,3,3,0," + ","3",null,10,"10","",15,"15"," + "]
[32,110,"n",108,108,"m",105,105,"i",5,1,"-","5",5,0,"","5",3,3,3,3,3,3,1," - ","3",null,25,"25","-",15,"15"," + "]
[33,99,"c",101,101,"e",106,106,"j",8,1,{"$f":"IF(K35=0,\"\",\"-\")","v":"-"},"8",{"$f":"INT(9*RAND()+1)","v":2},0,"","2",6,6,6,7,7,7,{"$f":"INT(2*RAND())","v":0}," + ","7",null,16,"16","-",56,"56",{"$f":"IF((K35+X35)=1,\" - \",\" + \")","v":" - "}]
[34,97,"a",110,110,"n",110,111,"o",3,0,"","3",4,0,"","4",3,3,3,3,3,3,1," - ","3",null,12,"12","",9,"9"," - "]
[35,106,"j",107,107,"k",97,97,"a",9,0,"","9",1,0,"","",1,1,1,1,1,1,1," - ","",null,9,"9","",9,"9"," - "]
[36,113,"q",104,104,"h",97,97,"a",4,0,"","4",6,0,"","6",5,5,5,5,5,5,1," - ","5",null,24,"24","",20,"20"," - "]
[37,118,"v",108,108,"m",118,119,"w",5,0,"","5",9,0,"","9",2,2,2,2,2,2,1," - ","2",null,45,"45","",10,"10"," - "]
[38,118,"v",100,100,"d",106,106,"j",8,0,"","8",1,0,"","",4,4,4,4,4,4,0," + ","4",null,8,"8","",32,"32"," + "]
[39,113,"q",115,115,"s",98,98,"b",5,1,"-","5",5,0,"","5",4,4,4,4,4,4,1," - ","4",null,25,"25","-",20,"20"," + "]
[40,102,"f",116,116,"t",106,106,"j",7,0,"","7",4,0,"","4",3,3,3,3,3,3,1," - ","3",null,28,"28","",21,"21"," - "]
[41,120,"x",115,115,"s",100,100,"d",6,0,"","6",5,0,"","5",5,5,5,5,6,6,0," + ","6",null,30,"30","",36,"36"," + "]
[42,109,"m",111,111,"o",109,110,"n",6,1,"-","6",3,0,"","3",2,2,2,2,2,2,0," + ","2",null,18,"18","-",12,"12"," - "]
[43,108,"m",113,113,"q",117,117,"u",8,1,"-","8",4,0,"","4",7,7,7,7,7,7,1," - ","7",null,32,"32","-",56,"56"," + "]
[44,110,"n",115,115,"s",107,107,"k",7,0,"","7",8,0,"","8",6,6,6,7,7,7,0," + ","7",null,56,"56","",49,"49"," + "]
[45,99,"c",98,98,"b",103,103,"g",4,0,"","4",5,0,"","5",3,3,3,3,3,3,0," + ","3",null,20,"20","",12,"12"," + "]
[46,102,"f",105,105,"i",112,112,"p",3,1,"-","3",1,0,"","",4,4,4,4,4,4,0," + ","4",null,3,"3","-",12,"12"," - "]
[47,107,"k",107,108,"m",106,106,"j",5,1,"-","5",8,0,"","8",2,2,2,3,3,3,1," - ","3",null,40,"40","-",15,"15"," + "]
[48,98,"b",110,110,"n",103,103,"g",4,0,"","4",4,0,"","4",7,7,7,7,7,7,0," + ","7",null,16,"16","",28,"28"," + "]
[49,120,"x",97,97,"a",112,112,"p",7,1,"-","7",4,0,"","4",2,2,2,3,3,3,1," - ","3",null,28,"28","-",21,"21"," + "]
[50,122,"z",107,107,"k",102,102,"f",9,1,"-","9",3,0,"","3",3,3,4,4,4,4,1," - ","4",null,27,"27","-",36,"36"," + "]
[51,98,"b",120,120,"x",113,113,"q",{"$f":"INT(9*RAND()+1)","v":4},1,"-","4",7,0,"","7",6,6,6,6,6,6,1," - ","6",null,28,"28","-",24,"24"," + "]
[52,112,"p",118,118,"v",100,100,"d",7,1,"-","7",7,0,"","7",6,6,6,6,6,6,1," - ","6",null,49,"49","-",42,"42"," + "]
[53,107,"k",100,100,"d",116,116,"t",8,{"$f":"INT(2*RAND())","v":1},"-","8",4,0,"","4",7,7,7,7,7,7,1," - ","7",null,32,"32","-",56,"56"," + "]
[54,120,"x",116,116,"t",102,102,"f",2,0,"","2",1,0,"","",6,6,6,6,6,6,0," + ","6",null,2,"2","",12,"12"," + "]
[55,103,"g",119,119,"w",107,107,"k",4,1,"-","4",8,0,"","8",6,6,6,7,7,7,0," + ","7",null,32,"32","-",28,"28"," - "]
[56,106,"j",108,108,"m",105,105,"i",2,0,"","2",9,0,"","9",5,5,5,5,5,5,0," + ","5",null,18,"18","",10,"10"," + "]
[57,120,"x",117,117,"u",116,116,"t",6,0,"","6",4,0,"","4",5,5,5,5,5,5,0," + ","5",null,24,"24","",30,"30"," + "]
[58,122,"z",119,119,"w",102,102,"f",7,0,"","7",8,0,"","8",3,3,3,3,3,3,0," + ","3",null,56,"56","",21,"21"," + "]
[59,118,"v",108,108,"m",101,101,"e",1,0,"","",2,0,"","2",1,1,1,1,1,1,1," - ","",null,2,"2","",1,""," - "]
[60,107,"k",110,110,"n",100,100,"d",3,0,"","3",2,0,"","2",2,2,2,3,3,3,0," + ","3",null,6,"6","",9,"9"," + "]
[61,118,"v",109,109,"m",108,108,"m",1,0,"","",4,0,"","4",6,6,6,7,7,7,0," + ","7",null,4,"4","",7,"7"," + "]
[62,109,"m",104,104,"h",103,103,"g",3,1,"-","3",6,0,"","6",4,4,4,5,5,5,0," + ","5",null,18,"18","-",15,"15"," - "]
[63,117,"u",106,106,"j",116,116,"t",8,1,"-","8",7,0,"","7",6,6,6,6,6,6,1," - ","6",null,56,"56","-",48,"48"," + "]
[64,119,"w",113,113,"q",102,102,"f",8,0,"","8",9,0,"","9",2,2,2,2,2,2,1," - ","2",null,72,"72","",16,"16"," - "]
[65,105,"i",110,110,"n",100,100,"d",3,1,{"$f":"IF(K67=0,\"\",\"-\")","v":"-"},"3",{"$f":"INT(9*RAND()+1)","v":3},0,"","3",7,7,7,7,7,7,{"$f":"INT(2*RAND())","v":0}," + ","7",null,9,"9","-",21,"21",{"$f":"IF((K67+X67)=1,\" - \",\" + \")","v":" - "}]
[66,{"$f":"RANDBETWEEN(97,122)","v":116},{"$f":"IF(B68=108,CHAR(B68+1),CHAR(B68))","v":"t"},{"$f":"RANDBETWEEN(97,120)","v":120},{"$f":"IF(D68=B68,D68+1,D68)","v":120},{"$f":"IF(E68=108,CHAR(E68+1),CHAR(E68))","v":"x"},{"$f":"RANDBETWEEN(97,119)","v":113},{"$f":"IF(OR(G68=B68,G68=E68),G68+1,G68)","v":113},{"$f":"IF(H68=108,CHAR(H68+1),CHAR(H68))","v":"q"},5,0,"",{"$f":"IF(J68=1,\"\",TEXT(J68,J68))","v":"5"},2,0,{"$f":"IF(O68=0,\"\",\"-\")","v":""},{"$f":"IF(N68=1,\"\",TEXT(N68,N68))","v":"2"},{"$f":"INT(7*RAND()+1)","v":4},{"$f":"IF(R68=1,1,(IF(AND(INT(N68/4)=N68/4,INT(R68/4)=R68/4),R68+1,R68)))","v":4},{"$f":"IF(AND(INT(N68/3)=N68/3,INT(S68/3)=S68/3 ),S68+1,S68)","v":4},{"$f":"IF(AND(INT(N68/2)=N68/2,INT(T68/2)=T68/2 ),T68+1,T68)","v":5},{"$f":"IF(AND(INT(N68/5)=N68/5,INT(U68/5)=U68/5 ),U68+1,U68)","v":5},{"$f":"IF(AND(INT(N68/2)=N68/2,INT(V68/2)=V68/2 ),V68+1,V68)","v":5},1,{"$f":"IF(X68=0,\" + \",\" - \")","v":" - "},"5",null,{"$f":"J68*N68","v":10},{"$f":"IF(AB68=1,\"\",TEXT($D$1,AB68))","v":"10"},{"$f":"IF((K68+O68)=1,\"-\",\"\")","v":""},{"$f":"J68*V68","v":25},{"$f":"IF(AE68=1,\"\",TEXT($D$1,AE68))","v":"25"}," - "]
[67,112,"p",98,98,"b",114,114,"r",2,1,"-","2",2,0,"","2",4,4,4,5,5,5,0," + ","5",null,4,"4","-",10,"10"," - "]
[68,98,"b",99,99,"c",106,106,"j",1,0,"","",7,0,"","7",4,4,4,4,4,4,1," - ","4",null,7,"7","",4,"4"," - "]
[69,107,"k",119,119,"w",103,103,"g",5,0,"","5",9,0,"","9",3,3,4,4,4,4,0," + ","4",null,45,"45","",20,"20"," + "]
[70,98,"b",101,101,"e",112,112,"p",9,1,"-","9",5,0,"","5",6,6,6,6,6,6,0," + ","6",null,45,"45","-",54,"54"," - "]
[71,110,"n",109,109,"m",103,103,"g",7,0,"","7",7,0,"","7",2,2,2,2,2,2,0," + ","2",null,49,"49","",14,"14"," + "]
[72,111,"o",116,116,"t",117,117,"u",1,1,"-","",5,0,"","5",2,2,2,2,2,2,1," - ","2",null,5,"5","-",2,"2"," + "]
[73,122,"z",116,116,"t",112,112,"p",3,0,"","3",7,0,"","7",7,7,7,7,7,7,0," + ","7",null,21,"21","",21,"21"," + "]
[74,119,"w",101,101,"e",113,113,"q",4,1,"-","4",9,0,"","9",2,2,2,2,2,2,0," + ","2",null,36,"36","-",8,"8"," - "]
[75,103,"g",120,120,"x",107,107,"k",8,0,"","8",3,0,"","3",1,1,1,1,1,1,0," + ","",null,24,"24","",8,"8"," + "]
[76,114,"r",101,101,"e",101,102,"f",8,1,"-",{"$f":"IF(J78=1,\"\",TEXT(J78,J78))","v":"8"},8,0,"",{"$f":"IF(N78=1,\"\",TEXT(N78,N78))","v":"8"},3,3,3,3,3,3,1," - ",{"$f":"TEXT(V78,V78)","v":"3"},null,64,"64","-",24,"24"," + "]
[77,122,"z",108,108,"m",100,100,"d",7,1,"-","7",8,0,"","8",1,1,1,1,1,1,1," - ",{"$f":"TEXT(V79,V79)","v":"1"},null,56,"56","-",7,"7"," + "]
[78,109,"m",108,108,"m",112,112,"p",4,1,"-","4",2,0,"","2",7,7,7,7,7,7,1," - ","7",null,8,"8","-",28,"28"," + "]
[79,114,"r",112,112,"p",116,116,"t",7,1,"-","7",2,0,"","2",3,3,3,3,3,3,1," - ","3",null,14,"14","-",21,"21"," + "]
[80,110,"n",99,99,"c",101,101,"e",1,0,"","",8,0,"","8",5,5,5,5,5,5,1," - ","5",null,8,"8","",5,"5"," - "]
[81,113,"q",107,107,"k",104,104,"h",2,0,"","2",5,0,"","5",1,1,1,1,1,1,{"$f":"INT(2*RAND())","v":0}," + ","1",null,10,"10","",2,"2"," + "]
[82,111,"o",97,97,"a",97,98,"b",{"$f":"INT(9*RAND()+1)","v":1},{"$f":"INT(2*RAND())","v":0},"","",{"$f":"INT(9*RAND()+1)","v":7},0,"","7",4,4,4,4,4,4,{"$f":"INT(2*RAND())","v":0}," + ","4",null,7,"7","",4,"4"," + "]
[83,98,"b",116,116,"t",104,104,"h",2,0,"","2",1,0,"","",3,3,3,3,3,3,0," + ","3",null,2,"2","",6,"6"," + "]
[84,118,"v",113,113,"q",116,116,"t",7,0,"","7",5,0,"","5",2,2,2,2,2,2,1," - ","2",null,35,"35","",14,"14"," - "]
[85,116,"t",106,106,"j",112,112,"p",8,1,"-","8",8,0,"","8",4,5,5,5,5,5,1," - ","5",null,64,"64","-",40,"40"," + "]
[86,98,"b",107,107,"k",107,108,"m",5,1,"-","5",9,0,"","9",7,7,7,7,7,7,1," - ",{"$f":"IF(V88=1,\"\",TEXT(V88,V88))","v":"7"},null,45,"45","-",35,"35"," + "]
[87,105,"i",120,120,"x",98,98,"b",7,0,"","7",3,0,"","3",4,4,4,4,4,4,1," - ","4",null,21,"21","",28,"28"," - "]
[88,122,"z",101,101,"e",105,105,"i",3,1,"-","3",1,0,"","",2,2,2,2,2,2,1," - ","2",null,3,"3","-",6,"6"," + "]
[89,103,"g",112,112,"p",114,114,"r",5,0,"","5",5,0,"","5",1,1,1,1,1,1,0," + ","",null,25,"25","",5,"5"," + "]
[90,98,"b",110,110,"n",115,115,"s",1,1,"-","",3,0,"","3",4,4,4,4,4,4,1," - ","4",null,3,"3","-",4,"4"," + "]
[91,97,"a",109,109,"m",97,98,"b",5,0,"","5",6,0,"","6",2,2,2,3,3,3,0," + ","3",null,30,"30","",15,"15"," + "]
[92,118,"v",105,105,"i",105,106,"j",7,1,"-","7",6,0,"","6",5,5,5,5,5,5,1," - ","5",null,42,"42","-",35,"35"," + "]
[93,111,"o",114,114,"r",118,118,"v",4,1,"-","4",1,0,"","",5,5,5,5,5,5,0," + ","5",null,4,"4","-",20,"20"," - "]
[94,118,"v",117,117,"u",108,108,"m",6,1,"-","6",2,0,"","2",6,6,6,7,7,7,1," - ","7",null,12,"12","-",42,"42"," + "]
[95,115,"s",116,116,"t",117,117,"u",6,1,"-","6",1,0,"","",7,7,7,7,7,7,0," + ","7",null,6,"6","-",42,"42"," - "]
[96,97,"a",106,106,"j",114,114,"r",3,1,"-","3",5,0,"","5",2,2,2,2,2,2,1," - ","2",null,15,"15","-",6,"6"," + "]
[97,103,"g",106,106,"j",110,110,"n",5,0,{"$f":"IF(K99=0,\"\",\"-\")","v":""},"5",3,0,"","3",5,5,5,5,5,5,1," - ","5",null,15,"15","",25,"25"," - "]
[98,107,"k",114,114,"r",116,116,"t",3,0,{"$f":"IF(K100=0,\"\",\"-\")","v":""},"3",7,0,"","7",6,6,6,6,6,6,0," + ","6",null,21,"21","",18,"18"," + "]
[99,105,"i",111,111,"o",106,106,"j",8,0,{"$f":"IF(K101=0,\"\",\"-\")","v":""},"8",3,0,"","3",2,2,2,2,2,2,1," - ","2",null,24,"24","",16,"16"," - "]
[100,119,"w",103,103,"g",102,102,"f",8,0,{"$f":"IF(K102=0,\"\",\"-\")","v":""},"8",4,0,"","4",4,5,5,5,5,5,0," + ","5",null,32,"32","",40,"40"," + "]