{"text_format":"1","workbook":"xlsx","n_sheets":4,"sheets":["Type","WorkSheet","Answers","Working"],"not_rendered":{"charts":0,"images":11,"macros":1,"external_links":0,"defined_names":0,"comments":0,"pivot_tables":0},"unopened":[],"bounds":{"document_bytes":16777216,"sheet_cells":100000,"rows_first":2000,"rows_last":500,"rows_between":2000,"halvings":0,"cell_chars":16384,"cell_head_chars":4096},"cells_cut":0,"cells_raw":0,"read":"whole","date_system":"1900"}

{"sheet":"Type","index":0,"n_rows":26,"n_cols":11,"rows_kept":26,"cut":false,"hidden":false,"merged":[[24,10,28,11],[25,2,27,8],[23,2,23,6],[2,2,2,6],[17,2,17,6]]}
[null,null,null,null,"METRIC CONVERSIONS"]
[null,null,null,null,"Length, Mass and Liquid Volume"]
[null,null,"INSTRUCTIONS"]
[null,"Step 1","Click to select the type of measurements to be used for this sheet."]
[]
[]
[]
[]
[]
[]
[]
[]
[]
[]
[]
[]
[]
[null,"Step 2","Click to select the type of operation."]
[]
[]
[]
[]
[]
[null,"Step 3","Click on WorkSheet tab below."]
[null,null,null,null,null,null,null,null,null,null,"PRESS F9 for NEW WorkSheet"]
[null,"Note","If you click on the WorkSheet tab then hold down shift and click on the Solutions tab, you will be able to print both the WorkSheet and the solutions."]

{"sheet":"WorkSheet","index":1,"n_rows":28,"n_cols":11,"rows_kept":28,"cut":false,"hidden":false,"merged":[]}
[null,null,null,null,null,"METRIC CONVERSIONS"]
[null,null,null,null,null,null,null,null,null,{"$f":"CONCATENATE(\"Worksheet \",Working!A1,Working!C1)","v":"Worksheet BNS-449"}]
["Convert each of the following metric measurements to the second unit of measurement"]
[{"$f":"Working!E4","v":"1)"},{"$f":"CONCATENATE(Working!AB4,\" \",Working!AC4)","v":"6 m³"},"=",null,{"$f":"Working!AE4","v":"cm³"},null,{"$f":"Working!E29","v":"26)"},{"$f":"CONCATENATE(Working!AB29,\" \",Working!AC29)","v":"62 m³"},"=",null,{"$f":"Working!AE29","v":"cm³"}]
[{"$f":"Working!E5","v":"2)"},{"$f":"CONCATENATE(Working!AB5,\" \",Working!AC5)","v":"16000 mL"},"=",null,{"$f":"Working!AE5","v":"L"},null,{"$f":"Working!E30","v":"27)"},{"$f":"CONCATENATE(Working!AB30,\" \",Working!AC30)","v":"90000 mg"},"=",null,{"$f":"Working!AE30","v":"g"}]
[{"$f":"Working!E6","v":"3)"},{"$f":"CONCATENATE(Working!AB6,\" \",Working!AC6)","v":"85 km²"},"=",null,{"$f":"Working!AE6","v":"cm²"},null,{"$f":"Working!E31","v":"28)"},{"$f":"CONCATENATE(Working!AB31,\" \",Working!AC31)","v":"36 m³"},"=",null,{"$f":"Working!AE31","v":"cm³"}]
[{"$f":"Working!E7","v":"4)"},{"$f":"CONCATENATE(Working!AB7,\" \",Working!AC7)","v":"92 m³"},"=",null,{"$f":"Working!AE7","v":"cm³"},null,{"$f":"Working!E32","v":"29)"},{"$f":"CONCATENATE(Working!AB32,\" \",Working!AC32)","v":"96 m³"},"=",null,{"$f":"Working!AE32","v":"mm³"}]
[{"$f":"Working!E8","v":"5)"},{"$f":"CONCATENATE(Working!AB8,\" \",Working!AC8)","v":"55 m³"},"=",null,{"$f":"Working!AE8","v":"mm³"},null,{"$f":"Working!E33","v":"30)"},{"$f":"CONCATENATE(Working!AB33,\" \",Working!AC33)","v":"22000000000 mm³"},"=",null,{"$f":"Working!AE33","v":"m³"}]
[{"$f":"Working!E9","v":"6)"},{"$f":"CONCATENATE(Working!AB9,\" \",Working!AC9)","v":"79 T"},"=",null,{"$f":"Working!AE9","v":"kg"},null,{"$f":"Working!E34","v":"31)"},{"$f":"CONCATENATE(Working!AB34,\" \",Working!AC34)","v":"25000000 mm"},"=",null,{"$f":"Working!AE34","v":"km"}]
[{"$f":"Working!E10","v":"7)"},{"$f":"CONCATENATE(Working!AB10,\" \",Working!AC10)","v":"28000000 mm²"},"=",null,{"$f":"Working!AE10","v":"m²"},null,{"$f":"Working!E35","v":"32)"},{"$f":"CONCATENATE(Working!AB35,\" \",Working!AC35)","v":"80 m³"},"=",null,{"$f":"Working!AE35","v":"cm³"}]
[{"$f":"Working!E11","v":"8)"},{"$f":"CONCATENATE(Working!AB11,\" \",Working!AC11)","v":"28 cm³"},"=",null,{"$f":"Working!AE11","v":"mm³"},null,{"$f":"Working!E36","v":"33)"},{"$f":"CONCATENATE(Working!AB36,\" \",Working!AC36)","v":"37000 mm³"},"=",null,{"$f":"Working!AE36","v":"cm³"}]
[{"$f":"Working!E12","v":"9)"},{"$f":"CONCATENATE(Working!AB12,\" \",Working!AC12)","v":"1200 cm"},"=",null,{"$f":"Working!AE12","v":"m"},null,{"$f":"Working!E37","v":"34)"},{"$f":"CONCATENATE(Working!AB37,\" \",Working!AC37)","v":"86000000 g"},"=",null,{"$f":"Working!AE37","v":"T"}]
[{"$f":"Working!E13","v":"10)"},{"$f":"CONCATENATE(Working!AB13,\" \",Working!AC13)","v":"77000000000 mm³"},"=",null,{"$f":"Working!AE13","v":"m³"},null,{"$f":"Working!E38","v":"35)"},{"$f":"CONCATENATE(Working!AB38,\" \",Working!AC38)","v":"21000000000 mg"},"=",null,{"$f":"Working!AE38","v":"T"}]
[{"$f":"Working!E14","v":"11)"},{"$f":"CONCATENATE(Working!AB14,\" \",Working!AC14)","v":"49 cm³"},"=",null,{"$f":"Working!AE14","v":"mm³"},null,{"$f":"Working!E39","v":"36)"},{"$f":"CONCATENATE(Working!AB39,\" \",Working!AC39)","v":"82000000000 mm³"},"=",null,{"$f":"Working!AE39","v":"m³"}]
[{"$f":"Working!E15","v":"12)"},{"$f":"CONCATENATE(Working!AB15,\" \",Working!AC15)","v":"94 cm³"},"=",null,{"$f":"Working!AE15","v":"mm³"},null,{"$f":"Working!E40","v":"37)"},{"$f":"CONCATENATE(Working!AB40,\" \",Working!AC40)","v":"63 m³"},"=",null,{"$f":"Working!AE40","v":"cm³"}]
[{"$f":"Working!E16","v":"13)"},{"$f":"CONCATENATE(Working!AB16,\" \",Working!AC16)","v":"45 m³"},"=",null,{"$f":"Working!AE16","v":"mm³"},null,{"$f":"Working!E41","v":"38)"},{"$f":"CONCATENATE(Working!AB41,\" \",Working!AC41)","v":"55000000 g"},"=",null,{"$f":"Working!AE41","v":"T"}]
[{"$f":"Working!E17","v":"14)"},{"$f":"CONCATENATE(Working!AB17,\" \",Working!AC17)","v":"67 km"},"=",null,{"$f":"Working!AE17","v":"m"},null,{"$f":"Working!E42","v":"39)"},{"$f":"CONCATENATE(Working!AB42,\" \",Working!AC42)","v":"53000 mm"},"=",null,{"$f":"Working!AE42","v":"m"}]
[{"$f":"Working!E18","v":"15)"},{"$f":"CONCATENATE(Working!AB18,\" \",Working!AC18)","v":"92000000 L"},"=",null,{"$f":"Working!AE18","v":"ML"},null,{"$f":"Working!E43","v":"40)"},{"$f":"CONCATENATE(Working!AB43,\" \",Working!AC43)","v":"82 m³"},"=",null,{"$f":"Working!AE43","v":"mm³"}]
[{"$f":"Working!E19","v":"16)"},{"$f":"CONCATENATE(Working!AB19,\" \",Working!AC19)","v":"76000000 cm³"},"=",null,{"$f":"Working!AE19","v":"m³"},null,{"$f":"Working!E44","v":"41)"},{"$f":"CONCATENATE(Working!AB44,\" \",Working!AC44)","v":"29 m³"},"=",null,{"$f":"Working!AE44","v":"cm³"}]
[{"$f":"Working!E20","v":"17)"},{"$f":"CONCATENATE(Working!AB20,\" \",Working!AC20)","v":"20000000 cm³"},"=",null,{"$f":"Working!AE20","v":"m³"},null,{"$f":"Working!E45","v":"42)"},{"$f":"CONCATENATE(Working!AB45,\" \",Working!AC45)","v":"78000000 L"},"=",null,{"$f":"Working!AE45","v":"ML"}]
[{"$f":"Working!E21","v":"18)"},{"$f":"CONCATENATE(Working!AB21,\" \",Working!AC21)","v":"18000000 cm³"},"=",null,{"$f":"Working!AE21","v":"m³"},null,{"$f":"Working!E46","v":"43)"},{"$f":"CONCATENATE(Working!AB46,\" \",Working!AC46)","v":"29 m³"},"=",null,{"$f":"Working!AE46","v":"mm³"}]
[{"$f":"Working!E22","v":"19)"},{"$f":"CONCATENATE(Working!AB22,\" \",Working!AC22)","v":"70000000000 cm²"},"=",null,{"$f":"Working!AE22","v":"km²"},null,{"$f":"Working!E47","v":"44)"},{"$f":"CONCATENATE(Working!AB47,\" \",Working!AC47)","v":"87 m³"},"=",null,{"$f":"Working!AE47","v":"mm³"}]
[{"$f":"Working!E23","v":"20)"},{"$f":"CONCATENATE(Working!AB23,\" \",Working!AC23)","v":"38 kg"},"=",null,{"$f":"Working!AE23","v":"g"},null,{"$f":"Working!E48","v":"45)"},{"$f":"CONCATENATE(Working!AB48,\" \",Working!AC48)","v":"96 ML"},"=",null,{"$f":"Working!AE48","v":"L"}]
[{"$f":"Working!E24","v":"21)"},{"$f":"CONCATENATE(Working!AB24,\" \",Working!AC24)","v":"24000000 cm³"},"=",null,{"$f":"Working!AE24","v":"m³"},null,{"$f":"Working!E49","v":"46)"},{"$f":"CONCATENATE(Working!AB49,\" \",Working!AC49)","v":"58000000000 mm³"},"=",null,{"$f":"Working!AE49","v":"m³"}]
[{"$f":"Working!E25","v":"22)"},{"$f":"CONCATENATE(Working!AB25,\" \",Working!AC25)","v":"79000000 L"},"=",null,{"$f":"Working!AE25","v":"ML"},null,{"$f":"Working!E50","v":"47)"},{"$f":"CONCATENATE(Working!AB50,\" \",Working!AC50)","v":"19 ML"},"=",null,{"$f":"Working!AE50","v":"L"}]
[{"$f":"Working!E26","v":"23)"},{"$f":"CONCATENATE(Working!AB26,\" \",Working!AC26)","v":"54 T"},"=",null,{"$f":"Working!AE26","v":"mg"},null,{"$f":"Working!E51","v":"48)"},{"$f":"CONCATENATE(Working!AB51,\" \",Working!AC51)","v":"91000000 mm"},"=",null,{"$f":"Working!AE51","v":"km"}]
[{"$f":"Working!E27","v":"24)"},{"$f":"CONCATENATE(Working!AB27,\" \",Working!AC27)","v":"98 cm³"},"=",null,{"$f":"Working!AE27","v":"mm³"},null,{"$f":"Working!E52","v":"49)"},{"$f":"CONCATENATE(Working!AB52,\" \",Working!AC52)","v":"90000 m"},"=",null,{"$f":"Working!AE52","v":"km"}]
[{"$f":"Working!E28","v":"25)"},{"$f":"CONCATENATE(Working!AB28,\" \",Working!AC28)","v":"39 cm³"},"=",null,{"$f":"Working!AE28","v":"mm³"},null,{"$f":"Working!E53","v":"50)"},{"$f":"CONCATENATE(Working!AB53,\" \",Working!AC53)","v":"44000000 cm³"},"=",null,{"$f":"Working!AE53","v":"m³"}]

{"sheet":"Answers","index":2,"n_rows":28,"n_cols":11,"rows_kept":28,"cut":false,"hidden":false,"merged":[]}
[null,null,null,null,null,"METRIC CONVERSIONS"]
[null,null,null,null,null,"Answers",null,null,null,{"$f":"CONCATENATE(\"Worksheet \",Working!A1,Working!C1)","v":"Worksheet BNS-449"}]
["Convert each of the following metric measurements to the second unit of measurement"]
[{"$f":"Working!E4","v":"1)"},{"$f":"CONCATENATE(Working!AB4,\" \",Working!AC4)","v":"6 m³"},"=",{"$f":"Working!AD4","v":6000000},{"$f":"Working!AE4","v":"cm³"},null,{"$f":"Working!E29","v":"26)"},{"$f":"CONCATENATE(Working!AB29,\" \",Working!AC29)","v":"62 m³"},"=",{"$f":"Working!AD29","v":62000000},{"$f":"Working!AE29","v":"cm³"}]
[{"$f":"Working!E5","v":"2)"},{"$f":"CONCATENATE(Working!AB5,\" \",Working!AC5)","v":"16000 mL"},"=",{"$f":"Working!AD5","v":16},{"$f":"Working!AE5","v":"L"},null,{"$f":"Working!E30","v":"27)"},{"$f":"CONCATENATE(Working!AB30,\" \",Working!AC30)","v":"90000 mg"},"=",{"$f":"Working!AD30","v":90},{"$f":"Working!AE30","v":"g"}]
[{"$f":"Working!E6","v":"3)"},{"$f":"CONCATENATE(Working!AB6,\" \",Working!AC6)","v":"85 km²"},"=",{"$f":"Working!AD6","v":850000000000},{"$f":"Working!AE6","v":"cm²"},null,{"$f":"Working!E31","v":"28)"},{"$f":"CONCATENATE(Working!AB31,\" \",Working!AC31)","v":"36 m³"},"=",{"$f":"Working!AD31","v":36000000},{"$f":"Working!AE31","v":"cm³"}]
[{"$f":"Working!E7","v":"4)"},{"$f":"CONCATENATE(Working!AB7,\" \",Working!AC7)","v":"92 m³"},"=",{"$f":"Working!AD7","v":92000000},{"$f":"Working!AE7","v":"cm³"},null,{"$f":"Working!E32","v":"29)"},{"$f":"CONCATENATE(Working!AB32,\" \",Working!AC32)","v":"96 m³"},"=",{"$f":"Working!AD32","v":96000000000},{"$f":"Working!AE32","v":"mm³"}]
[{"$f":"Working!E8","v":"5)"},{"$f":"CONCATENATE(Working!AB8,\" \",Working!AC8)","v":"55 m³"},"=",{"$f":"Working!AD8","v":55000000000},{"$f":"Working!AE8","v":"mm³"},null,{"$f":"Working!E33","v":"30)"},{"$f":"CONCATENATE(Working!AB33,\" \",Working!AC33)","v":"22000000000 mm³"},"=",{"$f":"Working!AD33","v":22},{"$f":"Working!AE33","v":"m³"}]
[{"$f":"Working!E9","v":"6)"},{"$f":"CONCATENATE(Working!AB9,\" \",Working!AC9)","v":"79 T"},"=",{"$f":"Working!AD9","v":79000},{"$f":"Working!AE9","v":"kg"},null,{"$f":"Working!E34","v":"31)"},{"$f":"CONCATENATE(Working!AB34,\" \",Working!AC34)","v":"25000000 mm"},"=",{"$f":"Working!AD34","v":25},{"$f":"Working!AE34","v":"km"}]
[{"$f":"Working!E10","v":"7)"},{"$f":"CONCATENATE(Working!AB10,\" \",Working!AC10)","v":"28000000 mm²"},"=",{"$f":"Working!AD10","v":28},{"$f":"Working!AE10","v":"m²"},null,{"$f":"Working!E35","v":"32)"},{"$f":"CONCATENATE(Working!AB35,\" \",Working!AC35)","v":"80 m³"},"=",{"$f":"Working!AD35","v":80000000},{"$f":"Working!AE35","v":"cm³"}]
[{"$f":"Working!E11","v":"8)"},{"$f":"CONCATENATE(Working!AB11,\" \",Working!AC11)","v":"28 cm³"},"=",{"$f":"Working!AD11","v":28000},{"$f":"Working!AE11","v":"mm³"},null,{"$f":"Working!E36","v":"33)"},{"$f":"CONCATENATE(Working!AB36,\" \",Working!AC36)","v":"37000 mm³"},"=",{"$f":"Working!AD36","v":37},{"$f":"Working!AE36","v":"cm³"}]
[{"$f":"Working!E12","v":"9)"},{"$f":"CONCATENATE(Working!AB12,\" \",Working!AC12)","v":"1200 cm"},"=",{"$f":"Working!AD12","v":12},{"$f":"Working!AE12","v":"m"},null,{"$f":"Working!E37","v":"34)"},{"$f":"CONCATENATE(Working!AB37,\" \",Working!AC37)","v":"86000000 g"},"=",{"$f":"Working!AD37","v":86},{"$f":"Working!AE37","v":"T"}]
[{"$f":"Working!E13","v":"10)"},{"$f":"CONCATENATE(Working!AB13,\" \",Working!AC13)","v":"77000000000 mm³"},"=",{"$f":"Working!AD13","v":77},{"$f":"Working!AE13","v":"m³"},null,{"$f":"Working!E38","v":"35)"},{"$f":"CONCATENATE(Working!AB38,\" \",Working!AC38)","v":"21000000000 mg"},"=",{"$f":"Working!AD38","v":21},{"$f":"Working!AE38","v":"T"}]
[{"$f":"Working!E14","v":"11)"},{"$f":"CONCATENATE(Working!AB14,\" \",Working!AC14)","v":"49 cm³"},"=",{"$f":"Working!AD14","v":49000},{"$f":"Working!AE14","v":"mm³"},null,{"$f":"Working!E39","v":"36)"},{"$f":"CONCATENATE(Working!AB39,\" \",Working!AC39)","v":"82000000000 mm³"},"=",{"$f":"Working!AD39","v":82},{"$f":"Working!AE39","v":"m³"}]
[{"$f":"Working!E15","v":"12)"},{"$f":"CONCATENATE(Working!AB15,\" \",Working!AC15)","v":"94 cm³"},"=",{"$f":"Working!AD15","v":94000},{"$f":"Working!AE15","v":"mm³"},null,{"$f":"Working!E40","v":"37)"},{"$f":"CONCATENATE(Working!AB40,\" \",Working!AC40)","v":"63 m³"},"=",{"$f":"Working!AD40","v":63000000},{"$f":"Working!AE40","v":"cm³"}]
[{"$f":"Working!E16","v":"13)"},{"$f":"CONCATENATE(Working!AB16,\" \",Working!AC16)","v":"45 m³"},"=",{"$f":"Working!AD16","v":45000000000},{"$f":"Working!AE16","v":"mm³"},null,{"$f":"Working!E41","v":"38)"},{"$f":"CONCATENATE(Working!AB41,\" \",Working!AC41)","v":"55000000 g"},"=",{"$f":"Working!AD41","v":55},{"$f":"Working!AE41","v":"T"}]
[{"$f":"Working!E17","v":"14)"},{"$f":"CONCATENATE(Working!AB17,\" \",Working!AC17)","v":"67 km"},"=",{"$f":"Working!AD17","v":67000},{"$f":"Working!AE17","v":"m"},null,{"$f":"Working!E42","v":"39)"},{"$f":"CONCATENATE(Working!AB42,\" \",Working!AC42)","v":"53000 mm"},"=",{"$f":"Working!AD42","v":53},{"$f":"Working!AE42","v":"m"}]
[{"$f":"Working!E18","v":"15)"},{"$f":"CONCATENATE(Working!AB18,\" \",Working!AC18)","v":"92000000 L"},"=",{"$f":"Working!AD18","v":92},{"$f":"Working!AE18","v":"ML"},null,{"$f":"Working!E43","v":"40)"},{"$f":"CONCATENATE(Working!AB43,\" \",Working!AC43)","v":"82 m³"},"=",{"$f":"Working!AD43","v":82000000000},{"$f":"Working!AE43","v":"mm³"}]
[{"$f":"Working!E19","v":"16)"},{"$f":"CONCATENATE(Working!AB19,\" \",Working!AC19)","v":"76000000 cm³"},"=",{"$f":"Working!AD19","v":76},{"$f":"Working!AE19","v":"m³"},null,{"$f":"Working!E44","v":"41)"},{"$f":"CONCATENATE(Working!AB44,\" \",Working!AC44)","v":"29 m³"},"=",{"$f":"Working!AD44","v":29000000},{"$f":"Working!AE44","v":"cm³"}]
[{"$f":"Working!E20","v":"17)"},{"$f":"CONCATENATE(Working!AB20,\" \",Working!AC20)","v":"20000000 cm³"},"=",{"$f":"Working!AD20","v":20},{"$f":"Working!AE20","v":"m³"},null,{"$f":"Working!E45","v":"42)"},{"$f":"CONCATENATE(Working!AB45,\" \",Working!AC45)","v":"78000000 L"},"=",{"$f":"Working!AD45","v":78},{"$f":"Working!AE45","v":"ML"}]
[{"$f":"Working!E21","v":"18)"},{"$f":"CONCATENATE(Working!AB21,\" \",Working!AC21)","v":"18000000 cm³"},"=",{"$f":"Working!AD21","v":18},{"$f":"Working!AE21","v":"m³"},null,{"$f":"Working!E46","v":"43)"},{"$f":"CONCATENATE(Working!AB46,\" \",Working!AC46)","v":"29 m³"},"=",{"$f":"Working!AD46","v":29000000000},{"$f":"Working!AE46","v":"mm³"}]
[{"$f":"Working!E22","v":"19)"},{"$f":"CONCATENATE(Working!AB22,\" \",Working!AC22)","v":"70000000000 cm²"},"=",{"$f":"Working!AD22","v":7},{"$f":"Working!AE22","v":"km²"},null,{"$f":"Working!E47","v":"44)"},{"$f":"CONCATENATE(Working!AB47,\" \",Working!AC47)","v":"87 m³"},"=",{"$f":"Working!AD47","v":87000000000},{"$f":"Working!AE47","v":"mm³"}]
[{"$f":"Working!E23","v":"20)"},{"$f":"CONCATENATE(Working!AB23,\" \",Working!AC23)","v":"38 kg"},"=",{"$f":"Working!AD23","v":38000},{"$f":"Working!AE23","v":"g"},null,{"$f":"Working!E48","v":"45)"},{"$f":"CONCATENATE(Working!AB48,\" \",Working!AC48)","v":"96 ML"},"=",{"$f":"Working!AD48","v":96000000},{"$f":"Working!AE48","v":"L"}]
[{"$f":"Working!E24","v":"21)"},{"$f":"CONCATENATE(Working!AB24,\" \",Working!AC24)","v":"24000000 cm³"},"=",{"$f":"Working!AD24","v":24},{"$f":"Working!AE24","v":"m³"},null,{"$f":"Working!E49","v":"46)"},{"$f":"CONCATENATE(Working!AB49,\" \",Working!AC49)","v":"58000000000 mm³"},"=",{"$f":"Working!AD49","v":58},{"$f":"Working!AE49","v":"m³"}]
[{"$f":"Working!E25","v":"22)"},{"$f":"CONCATENATE(Working!AB25,\" \",Working!AC25)","v":"79000000 L"},"=",{"$f":"Working!AD25","v":79},{"$f":"Working!AE25","v":"ML"},null,{"$f":"Working!E50","v":"47)"},{"$f":"CONCATENATE(Working!AB50,\" \",Working!AC50)","v":"19 ML"},"=",{"$f":"Working!AD50","v":19000000},{"$f":"Working!AE50","v":"L"}]
[{"$f":"Working!E26","v":"23)"},{"$f":"CONCATENATE(Working!AB26,\" \",Working!AC26)","v":"54 T"},"=",{"$f":"Working!AD26","v":54000000000},{"$f":"Working!AE26","v":"mg"},null,{"$f":"Working!E51","v":"48)"},{"$f":"CONCATENATE(Working!AB51,\" \",Working!AC51)","v":"91000000 mm"},"=",{"$f":"Working!AD51","v":91},{"$f":"Working!AE51","v":"km"}]
[{"$f":"Working!E27","v":"24)"},{"$f":"CONCATENATE(Working!AB27,\" \",Working!AC27)","v":"98 cm³"},"=",{"$f":"Working!AD27","v":98000},{"$f":"Working!AE27","v":"mm³"},null,{"$f":"Working!E52","v":"49)"},{"$f":"CONCATENATE(Working!AB52,\" \",Working!AC52)","v":"90000 m"},"=",{"$f":"Working!AD52","v":90},{"$f":"Working!AE52","v":"km"}]
[{"$f":"Working!E28","v":"25)"},{"$f":"CONCATENATE(Working!AB28,\" \",Working!AC28)","v":"39 cm³"},"=",{"$f":"Working!AD28","v":39000},{"$f":"Working!AE28","v":"mm³"},null,{"$f":"Working!E53","v":"50)"},{"$f":"CONCATENATE(Working!AB53,\" \",Working!AC53)","v":"44000000 cm³"},"=",{"$f":"Working!AD53","v":44},{"$f":"Working!AE53","v":"m³"}]

{"sheet":"Working","index":3,"n_rows":103,"n_cols":31,"rows_kept":103,"cut":false,"hidden":true,"merged":[]}
["BNS-",null,{"$f":"INT(999*RAND()+1)","v":449}]
[null,null,null,null,null,null,null,null,null,null,null,null,null,null,null,null,null,null,null,"Thought","Fill in missing number?",null,null,"Make left the big number"]
[null,"Unit","Ratio of units",null,null,"Type","1st Unit",null,null,null,"×/÷",null,null,null,null,null,"2nd Unit",null,null,null,null,null,null,null,null,null,null,"×/÷"]
[1,"mm",1,1,{"$f":"CONCATENATE(D4,\")\")","v":"1)"},{"$f":"INT(8*RAND()+1)","v":8},{"$f":"IF(F4=1,INT(4*(RAND())+1),IF(F4=2,INT(4*(RAND())+1),IF(F4=3,INT(3*(RAND())+1),IF(F4=4,INT(5*(RAND())+1),INT(3*(RAND())+1)))))","v":3},{"$f":"IF(F4=1,IF(G4=1,1,IF(G4=2,2,IF(G4=3,3,IF(G4=4,4,5)))),IF(F4=2,IF(G4=1,6,IF(G4=2,7,IF(G4=3,8,IF(G4=4,9,10)))),IF(F4=3,IF(G4=1,11,IF(G4=2,12,IF(G4=3,13,IF(G4=4,14,15)))),IF(F4=4,IF(G4=1,16,IF(G4=2,17,IF(G4=3,18,IF(G4=4,19,20)))),IF(G4=1,21,IF(G4=2,22,IF(G4=3,23,IF(G4=4,24,25))))))))","v":23},{"$f":"OFFSET($B$3,H4,0,1,1)","v":"m³"},{"$f":"OFFSET($C$3,H4,0,1,1)","v":1000000000},{"$f":"INT(2*RAND()+1)","v":1},{"$f":"IF(K4=1,\"×\",\"÷\")","v":"×"},{"$f":"IF(F4=1,\"Length\",IF(F4=2,\"Mass\",IF(F4=3,\"Capacity\",IF(F4=4,\"Area\",\"Volume\"))))","v":"Volume"},{"$f":"IF(F4=1,INT(4*(RAND())+1),IF(F4=2,INT(4*(RAND())+1),IF(F4=3,INT(3*(RAND())+1),IF(F4=4,INT(5*(RAND())+1),INT(3*(RAND())+1)))))","v":2},{"$f":"IF(N4=$G4,IF(F4=1,INT(4*(RAND())+1),IF(F4=2,INT(4*(RAND())+1),IF(F4=3,INT(3*(RAND())+1),IF(F4=4,INT(5*(RAND())+1),INT(3*(RAND())+1))))),N4)","v":2},{"$f":"IF(O4=$G4,IF(F4=1,INT(4*(RAND())+1),IF(F4=2,INT(4*(RAND())+1),IF(F4=3,INT(3*(RAND())+1),IF(F4=4,INT(5*(RAND())+1),INT(3*(RAND())+1))))),O4)","v":2},{"$f":"IF(P4=$G4,IF(F4=1,INT(4*(RAND())+1),IF(F4=2,INT(4*(RAND())+1),IF(F4=3,INT(3*(RAND())+1),IF(F4=4,INT(5*(RAND())+1),INT(3*(RAND())+1))))),P4)","v":2},{"$f":"IF(F4=1,IF(Q4=1,1,IF(Q4=2,2,IF(Q4=3,3,IF(Q4=4,4,5)))),IF(F4=2,IF(Q4=1,6,IF(Q4=2,7,IF(Q4=3,8,IF(Q4=4,9,10)))),IF(F4=3,IF(Q4=1,11,IF(Q4=2,12,IF(Q4=3,13,IF(Q4=4,14,15)))),IF(F4=4,IF(Q4=1,16,IF(Q4=2,17,IF(Q4=3,18,IF(Q4=4,19,20)))),IF(Q4=1,21,IF(Q4=2,22,IF(Q4=3,23,IF(Q4=4,24,25))))))))","v":22},{"$f":"OFFSET($B$3,R4,0,1,1)","v":"cm³"},{"$f":"OFFSET($C$3,R4,0,1,1)","v":1000},{"$f":"INT(99*(RAND())+1)","v":6},{"$f":"IF(T4>J4,U4*T4/J4,U4*J4/T4)","v":6000000},{"$f":"IF(T4>J4,S4,I4)","v":"m³"},{"$f":"IF(T4>J4,I4,S4)","v":"cm³"},{"$f":"IF(T4<J4,U4*T4/J4,U4*J4/T4)","v":6.0000000000000002E-6},{"$f":"IF(T4<J4,S4,I4)","v":"cm³"},{"$f":"IF(T4<J4,I4,S4)","v":"m³"},{"$f":"IF(K4=1,U4,V4)","v":6},{"$f":"IF(K4=1,W4,X4)","v":"m³"},{"$f":"IF(K4=1,V4,U4)","v":6000000},{"$f":"IF(K4=1,X4,W4)","v":"cm³"}]
[2,"cm",10,2,{"$f":"CONCATENATE(D5,\")\")","v":"2)"},3,{"$f":"IF(F5=1,INT(4*(RAND())+1),IF(F5=2,INT(4*(RAND())+1),IF(F5=3,INT(3*(RAND())+1),IF(F5=4,INT(5*(RAND())+1),INT(3*(RAND())+1)))))","v":2},{"$f":"IF(F5=1,IF(G5=1,1,IF(G5=2,2,IF(G5=3,3,IF(G5=4,4,5)))),IF(F5=2,IF(G5=1,6,IF(G5=2,7,IF(G5=3,8,IF(G5=4,9,10)))),IF(F5=3,IF(G5=1,11,IF(G5=2,12,IF(G5=3,13,IF(G5=4,14,15)))),IF(F5=4,IF(G5=1,16,IF(G5=2,17,IF(G5=3,18,IF(G5=4,19,20)))),IF(G5=1,21,IF(G5=2,22,IF(G5=3,23,IF(G5=4,24,25))))))))","v":12},{"$f":"OFFSET($B$3,H5,0,1,1)","v":"L"},{"$f":"OFFSET($C$3,H5,0,1,1)","v":1000},2,{"$f":"IF(K5=1,\"×\",\"÷\")","v":"÷"},"Capacity",{"$f":"IF(F5=1,INT(4*(RAND())+1),IF(F5=2,INT(4*(RAND())+1),IF(F5=3,INT(3*(RAND())+1),IF(F5=4,INT(5*(RAND())+1),INT(3*(RAND())+1)))))","v":2},{"$f":"IF(N5=$G5,IF(F5=1,INT(4*(RAND())+1),IF(F5=2,INT(4*(RAND())+1),IF(F5=3,INT(3*(RAND())+1),IF(F5=4,INT(5*(RAND())+1),INT(3*(RAND())+1))))),N5)","v":2},{"$f":"IF(O5=$G5,IF(F5=1,INT(4*(RAND())+1),IF(F5=2,INT(4*(RAND())+1),IF(F5=3,INT(3*(RAND())+1),IF(F5=4,INT(5*(RAND())+1),INT(3*(RAND())+1))))),O5)","v":1},{"$f":"IF(P5=$G5,IF(F5=1,INT(4*(RAND())+1),IF(F5=2,INT(4*(RAND())+1),IF(F5=3,INT(3*(RAND())+1),IF(F5=4,INT(5*(RAND())+1),INT(3*(RAND())+1))))),P5)","v":1},{"$f":"IF(F5=1,IF(Q5=1,1,IF(Q5=2,2,IF(Q5=3,3,IF(Q5=4,4,5)))),IF(F5=2,IF(Q5=1,6,IF(Q5=2,7,IF(Q5=3,8,IF(Q5=4,9,10)))),IF(F5=3,IF(Q5=1,11,IF(Q5=2,12,IF(Q5=3,13,IF(Q5=4,14,15)))),IF(F5=4,IF(Q5=1,16,IF(Q5=2,17,IF(Q5=3,18,IF(Q5=4,19,20)))),IF(Q5=1,21,IF(Q5=2,22,IF(Q5=3,23,IF(Q5=4,24,25))))))))","v":11},{"$f":"OFFSET($B$3,R5,0,1,1)","v":"mL"},{"$f":"OFFSET($C$3,R5,0,1,1)","v":1},{"$f":"INT(99*(RAND())+1)","v":16},{"$f":"IF(T5>J5,U5*T5/J5,U5*J5/T5)","v":16000},{"$f":"IF(T5>J5,S5,I5)","v":"L"},{"$f":"IF(T5>J5,I5,S5)","v":"mL"},{"$f":"IF(T5<J5,U5*T5/J5,U5*J5/T5)","v":1.6E-2},{"$f":"IF(T5<J5,S5,I5)","v":"mL"},{"$f":"IF(T5<J5,I5,S5)","v":"L"},{"$f":"IF(K5=1,U5,V5)","v":16000},{"$f":"IF(K5=1,W5,X5)","v":"mL"},{"$f":"IF(K5=1,V5,U5)","v":16},{"$f":"IF(K5=1,X5,W5)","v":"L"}]
[3,"m",1000,3,"3)",4,2,17,"cm²",100,1,"×","Area",5,5,5,5,20,"km²",1000000000000,85,850000000000,"km²","cm²",8.5E-9,"cm²","km²",85,"km²",850000000000,"cm²"]
[4,"km",1000000,4,"4)",8,2,22,"cm³",1000,1,"×","Volume",2,3,3,3,23,"m³",1000000000,92,92000000,"m³","cm³",9.2E-5,"cm³","m³",92,"m³",92000000,"cm³"]
[null,null,null,5,"5)",5,3,23,"m³",1000000000,1,"×","Volume",3,1,1,1,21,"mm³",1,55,55000000000,"m³","mm³",5.5000000000000003E-8,"mm³","m³",55,"m³",55000000000,"mm³"]
[6,"mg",1,6,"6)",2,4,9,"T",1000000000,1,"×","Mass",4,4,3,3,8,"kg",1000000,79,79000,"T","kg",7.9000000000000001E-2,"kg","T",79,"T",79000,"kg"]
[7,"g",1000,7,"7)",4,3,18,"m²",1000000,2,"÷","Area",3,1,1,1,16,"mm²",1,28,28000000,"m²","mm²",2.8E-5,"mm²","m²",28000000,"mm²",28,"m²"]
[8,"kg",1000000,8,"8)",6,2,22,"cm³",1000,1,"×","Volume",2,1,1,1,21,"mm³",1,28,28000,"cm³","mm³",2.8000000000000001E-2,"mm³","cm³",28,"cm³",28000,"mm³"]
[9,"T",1000000000,9,"9)",1,3,3,"m",1000,2,"÷","Length",2,2,2,2,2,"cm",10,12,1200,"m","cm",0.12,"cm","m",1200,"cm",12,"m"]
[null,null,null,10,"10)",8,1,21,"mm³",1,2,"÷","Volume",3,3,3,3,23,"m³",1000000000,77,77000000000,"m³","mm³",7.7000000000000001E-8,"mm³","m³",77000000000,"mm³",77,"m³"]
[11,"mL",1,11,"11)",8,2,22,"cm³",1000,1,"×","Volume",1,1,1,1,21,"mm³",1,49,49000,"cm³","mm³",4.9000000000000002E-2,"mm³","cm³",49,"cm³",49000,"mm³"]
[12,"L",1000,12,"12)",6,2,22,"cm³",1000,1,"×","Volume",1,1,1,1,21,"mm³",1,94,94000,"cm³","mm³",9.4E-2,"mm³","cm³",94,"cm³",94000,"mm³"]
[13,"ML",1000000000,13,"13)",5,3,23,"m³",1000000000,1,"×","Volume",3,1,1,1,21,"mm³",1,45,45000000000,"m³","mm³",4.4999999999999999E-8,"mm³","m³",45,"m³",45000000000,"mm³"]
[null,null,null,14,"14)",1,3,3,"m",1000,1,"×","Length",4,4,4,4,4,"km",1000000,67,67000,"km","m",6.7000000000000004E-2,"m","km",67,"km",67000,"m"]
[null,null,null,15,"15)",3,2,12,"L",1000,2,"÷","Capacity",3,3,3,3,13,"ML",1000000000,92,92000000,"ML","L",9.2E-5,"L","ML",92000000,"L",92,"ML"]
[16,"mm²",1,16,"16)",5,2,22,"cm³",1000,2,"÷","Volume",3,3,3,3,23,"m³",1000000000,76,76000000,"m³","cm³",7.6000000000000004E-5,"cm³","m³",76000000,"cm³",76,"m³"]
[17,"cm²",100,17,"17)",7,2,22,"cm³",1000,2,"÷","Volume",3,3,3,3,23,"m³",1000000000,20,20000000,"m³","cm³",2.0000000000000002E-5,"cm³","m³",20000000,"cm³",20,"m³"]
[18,"m²",1000000,18,"18)",8,3,23,"m³",1000000000,2,"÷","Volume",2,2,2,2,22,"cm³",1000,18,18000000,"m³","cm³",1.8E-5,"cm³","m³",18000000,"cm³",18,"m³"]
[19,"ha",10000000000,19,"19)",4,2,17,"cm²",100,2,"÷","Area",2,5,5,5,20,"km²",1000000000000,7,70000000000,"km²","cm²",6.9999999999999996E-10,"cm²","km²",70000000000,"cm²",7,"km²"]
[20,"km²",1000000000000,20,"20)",2,3,8,"kg",1000000,1,"×","Mass",2,2,2,2,7,"g",1000,38,38000,"kg","g",3.7999999999999999E-2,"g","kg",38,"kg",38000,"g"]
[21,"mm³",1,21,"21)",6,2,22,"cm³",1000,2,"÷","Volume",3,3,3,3,23,"m³",1000000000,24,24000000,"m³","cm³",2.4000000000000001E-5,"cm³","m³",24000000,"cm³",24,"m³"]
[22,"cm³",1000,22,"22)",3,3,13,"ML",1000000000,2,"÷","Capacity",2,2,2,2,12,"L",1000,79,79000000,"ML","L",7.8999999999999996E-5,"L","ML",79000000,"L",79,"ML"]
[23,"m³",1000000000,23,"23)",2,4,9,"T",1000000000,1,"×","Mass",1,1,1,1,6,"mg",1,54,54000000000,"T","mg",5.4E-8,"mg","T",54,"T",54000000000,"mg"]
[null,null,null,24,"24)",5,1,21,"mm³",1,1,"×","Volume",2,2,2,2,22,"cm³",1000,98,98000,"cm³","mm³",9.8000000000000004E-2,"mm³","cm³",98,"cm³",98000,"mm³"]
[null,null,null,25,"25)",6,2,22,"cm³",1000,1,"×","Volume",1,1,1,1,21,"mm³",1,39,39000,"cm³","mm³",3.9E-2,"mm³","cm³",39,"cm³",39000,"mm³"]
[null,null,null,26,"26)",6,3,23,"m³",1000000000,1,"×","Volume",2,2,2,2,22,"cm³",1000,62,62000000,"m³","cm³",6.2000000000000003E-5,"cm³","m³",62,"m³",62000000,"cm³"]
[null,null,null,27,"27)",2,1,6,"mg",1,2,"÷","Mass",2,2,2,2,7,"g",1000,90,90000,"g","mg",0.09,"mg","g",90000,"mg",90,"g"]
[null,null,null,28,"28)",5,3,23,"m³",1000000000,1,"×","Volume",2,2,2,2,22,"cm³",1000,36,36000000,"m³","cm³",3.6000000000000001E-5,"cm³","m³",36,"m³",36000000,"cm³"]
[null,null,null,29,"29)",7,1,21,"mm³",1,1,"×","Volume",3,3,3,3,23,"m³",1000000000,96,96000000000,"m³","mm³",9.5999999999999999E-8,"mm³","m³",96,"m³",96000000000,"mm³"]
[null,null,null,30,"30)",8,1,21,"mm³",1,2,"÷","Volume",3,3,3,3,23,"m³",1000000000,22,22000000000,"m³","mm³",2.1999999999999998E-8,"mm³","m³",22000000000,"mm³",22,"m³"]
[null,null,null,31,"31)",1,1,1,"mm",1,2,"÷","Length",4,4,4,4,4,"km",1000000,25,25000000,"km","mm",2.5000000000000001E-5,"mm","km",25000000,"mm",25,"km"]
[null,null,null,32,"32)",8,2,22,"cm³",1000,1,"×","Volume",3,3,3,3,23,"m³",1000000000,80,80000000,"m³","cm³",8.0000000000000007E-5,"cm³","m³",80,"m³",80000000,"cm³"]
[null,null,null,33,"33)",{"$f":"INT(8*RAND()+1)","v":8},2,22,"cm³",1000,{"$f":"INT(2*RAND()+1)","v":2},"÷",{"$f":"IF(F36=1,\"Length\",IF(F36=2,\"Mass\",IF(F36=3,\"Capacity\",IF(F36=4,\"Area\",\"Volume\"))))","v":"Volume"},1,1,1,1,21,"mm³",1,37,37000,"cm³","mm³",3.6999999999999998E-2,"mm³","cm³",37000,"mm³",37,"cm³"]
[null,null,null,34,"34)",2,4,9,"T",1000000000,2,"÷","Mass",4,2,2,2,7,"g",1000,86,86000000,"T","g",8.6000000000000003E-5,"g","T",86000000,"g",86,"T"]
[null,null,null,35,"35)",2,4,9,"T",1000000000,2,"÷","Mass",1,1,1,1,6,"mg",1,21,21000000000,"T","mg",2.0999999999999999E-8,"mg","T",21000000000,"mg",21,"T"]
[null,null,null,36,"36)",5,3,23,"m³",1000000000,2,"÷","Volume",1,1,1,1,21,"mm³",1,82,82000000000,"m³","mm³",8.2000000000000006E-8,"mm³","m³",82000000000,"mm³",82,"m³"]
[null,null,null,37,"37)",7,3,23,"m³",1000000000,1,"×","Volume",3,2,2,2,22,"cm³",1000,63,63000000,"m³","cm³",6.3E-5,"cm³","m³",63,"m³",63000000,"cm³"]
[null,null,null,38,"38)",2,2,7,"g",1000,2,"÷","Mass",4,4,4,4,9,"T",1000000000,55,55000000,"T","g",5.5000000000000002E-5,"g","T",55000000,"g",55,"T"]
[null,null,null,39,"39)",1,3,3,"m",1000,2,"÷","Length",1,1,1,1,1,"mm",1,53,53000,"m","mm",5.2999999999999999E-2,"mm","m",53000,"mm",53,"m"]
[null,null,null,40,"40)",7,3,23,"m³",1000000000,1,"×","Volume",3,1,1,1,21,"mm³",1,82,82000000000,"m³","mm³",8.2000000000000006E-8,"mm³","m³",82,"m³",82000000000,"mm³"]
[null,null,null,41,"41)",7,2,22,"cm³",1000,1,"×","Volume",2,3,3,3,23,"m³",1000000000,29,29000000,"m³","cm³",2.9E-5,"cm³","m³",29,"m³",29000000,"cm³"]
[null,null,null,42,"42)",3,2,12,"L",1000,2,"÷","Capacity",2,2,3,3,13,"ML",1000000000,78,78000000,"ML","L",7.7999999999999999E-5,"L","ML",78000000,"L",78,"ML"]
[null,null,null,43,"43)",5,3,23,"m³",1000000000,1,"×","Volume",1,1,1,1,21,"mm³",1,29,29000000000,"m³","mm³",2.9000000000000002E-8,"mm³","m³",29,"m³",29000000000,"mm³"]
[null,null,null,44,"44)",8,3,23,"m³",1000000000,1,"×","Volume",3,3,1,1,21,"mm³",1,87,87000000000,"m³","mm³",8.6999999999999998E-8,"mm³","m³",87,"m³",87000000000,"mm³"]
[null,null,null,45,"45)",3,2,12,"L",1000,1,"×","Capacity",3,3,3,3,13,"ML",1000000000,96,96000000,"ML","L",9.6000000000000002E-5,"L","ML",96,"ML",96000000,"L"]
[null,null,null,46,"46)",6,3,23,"m³",1000000000,2,"÷","Volume",1,1,1,1,21,"mm³",1,58,58000000000,"m³","mm³",5.8000000000000003E-8,"mm³","m³",58000000000,"mm³",58,"m³"]
[null,null,null,47,"47)",3,2,12,"L",1000,1,"×","Capacity",2,2,2,3,13,"ML",1000000000,19,19000000,"ML","L",1.9000000000000001E-5,"L","ML",19,"ML",19000000,"L"]
[null,null,null,48,"48)",1,1,1,"mm",1,2,"÷","Length",4,4,4,4,4,"km",1000000,91,91000000,"km","mm",9.1000000000000003E-5,"mm","km",91000000,"mm",91,"km"]
[null,null,null,49,"49)",1,3,3,"m",1000,2,"÷","Length",4,4,4,4,4,"km",1000000,90,90000,"km","m",0.09,"m","km",90000,"m",90,"km"]
[null,null,null,50,"50)",7,3,23,"m³",1000000000,2,"÷","Volume",3,2,2,2,22,"cm³",1000,44,44000000,"m³","cm³",4.3999999999999999E-5,"cm³","m³",44000000,"cm³",44,"m³"]
[null,null,null,51,"51)",8,3,23,"m³",1000000000,1,"×","Volume",1,1,1,1,21,"mm³",1,42,42000000000,"m³","mm³",4.1999999999999999E-8,"mm³","m³",42,"m³",42000000000,"mm³"]
[null,null,null,52,"52)",3,1,11,"mL",1,2,"÷","Capacity",2,2,2,2,12,"L",1000,89,89000,"L","mL",8.8999999999999996E-2,"mL","L",89000,"mL",89,"L"]
[null,null,null,53,"53)",4,3,18,"m²",1000000,2,"÷","Area",1,1,1,1,16,"mm²",1,75,75000000,"m²","mm²",7.4999999999999993E-5,"mm²","m²",75000000,"mm²",75,"m²"]
[null,null,null,54,"54)",6,2,22,"cm³",1000,2,"÷","Volume",3,3,3,3,23,"m³",1000000000,78,78000000,"m³","cm³",7.7999999999999999E-5,"cm³","m³",78000000,"cm³",78,"m³"]
[null,null,null,55,"55)",3,3,13,"ML",1000000000,2,"÷","Capacity",2,2,2,2,12,"L",1000,20,20000000,"ML","L",2.0000000000000002E-5,"L","ML",20000000,"L",20,"ML"]
[null,null,null,56,"56)",6,2,22,"cm³",1000,1,"×","Volume",3,3,3,3,23,"m³",1000000000,47,47000000,"m³","cm³",4.6999999999999997E-5,"cm³","m³",47,"m³",47000000,"cm³"]
[null,null,null,57,"57)",7,3,23,"m³",1000000000,1,"×","Volume",3,2,2,2,22,"cm³",1000,64,64000000,"m³","cm³",6.3999999999999997E-5,"cm³","m³",64,"m³",64000000,"cm³"]
[null,null,null,58,"58)",3,2,12,"L",1000,2,"÷","Capacity",1,1,1,1,11,"mL",1,48,48000,"L","mL",4.8000000000000001E-2,"mL","L",48000,"mL",48,"L"]
[null,null,null,59,"59)",8,1,21,"mm³",1,2,"÷","Volume",2,2,2,2,22,"cm³",1000,76,76000,"cm³","mm³",7.5999999999999998E-2,"mm³","cm³",76000,"mm³",76,"cm³"]
[null,null,null,60,"60)",5,1,21,"mm³",1,2,"÷","Volume",3,3,3,3,23,"m³",1000000000,87,87000000000,"m³","mm³",8.6999999999999998E-8,"mm³","m³",87000000000,"mm³",87,"m³"]
[null,null,null,61,"61)",2,3,8,"kg",1000000,1,"×","Mass",1,1,1,1,6,"mg",1,73,73000000,"kg","mg",7.2999999999999999E-5,"mg","kg",73,"kg",73000000,"mg"]
[null,null,null,62,"62)",7,1,21,"mm³",1,2,"÷","Volume",2,2,2,2,22,"cm³",1000,2,2000,"cm³","mm³",2E-3,"mm³","cm³",2000,"mm³",2,"cm³"]
[null,null,null,63,"63)",5,1,21,"mm³",1,1,"×","Volume",2,2,2,2,22,"cm³",1000,84,84000,"cm³","mm³",8.4000000000000005E-2,"mm³","cm³",84,"cm³",84000,"mm³"]
[null,null,null,64,"64)",1,1,1,"mm",1,1,"×","Length",1,4,4,4,4,"km",1000000,65,65000000,"km","mm",6.4999999999999994E-5,"mm","km",65,"km",65000000,"mm"]
[null,null,null,65,"65)",{"$f":"INT(8*RAND()+1)","v":3},1,11,"mL",1,{"$f":"INT(2*RAND()+1)","v":2},"÷",{"$f":"IF(F68=1,\"Length\",IF(F68=2,\"Mass\",IF(F68=3,\"Capacity\",IF(F68=4,\"Area\",\"Volume\"))))","v":"Capacity"},1,3,3,3,13,"ML",1000000000,42,42000000000,"ML","mL",4.1999999999999999E-8,"mL","ML",42000000000,"mL",42,"ML"]
[null,null,null,66,{"$f":"CONCATENATE(D69,\")\")","v":"66)"},8,{"$f":"IF(F69=1,INT(4*(RAND())+1),IF(F69=2,INT(4*(RAND())+1),IF(F69=3,INT(3*(RAND())+1),IF(F69=4,INT(5*(RAND())+1),INT(3*(RAND())+1)))))","v":1},{"$f":"IF(F69=1,IF(G69=1,1,IF(G69=2,2,IF(G69=3,3,IF(G69=4,4,5)))),IF(F69=2,IF(G69=1,6,IF(G69=2,7,IF(G69=3,8,IF(G69=4,9,10)))),IF(F69=3,IF(G69=1,11,IF(G69=2,12,IF(G69=3,13,IF(G69=4,14,15)))),IF(F69=4,IF(G69=1,16,IF(G69=2,17,IF(G69=3,18,IF(G69=4,19,20)))),IF(G69=1,21,IF(G69=2,22,IF(G69=3,23,IF(G69=4,24,25))))))))","v":21},{"$f":"OFFSET($B$3,H69,0,1,1)","v":"mm³"},{"$f":"OFFSET($C$3,H69,0,1,1)","v":1},1,{"$f":"IF(K69=1,\"×\",\"÷\")","v":"×"},"Volume",{"$f":"IF(F69=1,INT(4*(RAND())+1),IF(F69=2,INT(4*(RAND())+1),IF(F69=3,INT(3*(RAND())+1),IF(F69=4,INT(5*(RAND())+1),INT(3*(RAND())+1)))))","v":2},{"$f":"IF(N69=$G69,IF(F69=1,INT(4*(RAND())+1),IF(F69=2,INT(4*(RAND())+1),IF(F69=3,INT(3*(RAND())+1),IF(F69=4,INT(5*(RAND())+1),INT(3*(RAND())+1))))),N69)","v":2},{"$f":"IF(O69=$G69,IF(F69=1,INT(4*(RAND())+1),IF(F69=2,INT(4*(RAND())+1),IF(F69=3,INT(3*(RAND())+1),IF(F69=4,INT(5*(RAND())+1),INT(3*(RAND())+1))))),O69)","v":2},{"$f":"IF(P69=$G69,IF(F69=1,INT(4*(RAND())+1),IF(F69=2,INT(4*(RAND())+1),IF(F69=3,INT(3*(RAND())+1),IF(F69=4,INT(5*(RAND())+1),INT(3*(RAND())+1))))),P69)","v":2},{"$f":"IF(F69=1,IF(Q69=1,1,IF(Q69=2,2,IF(Q69=3,3,IF(Q69=4,4,5)))),IF(F69=2,IF(Q69=1,6,IF(Q69=2,7,IF(Q69=3,8,IF(Q69=4,9,10)))),IF(F69=3,IF(Q69=1,11,IF(Q69=2,12,IF(Q69=3,13,IF(Q69=4,14,15)))),IF(F69=4,IF(Q69=1,16,IF(Q69=2,17,IF(Q69=3,18,IF(Q69=4,19,20)))),IF(Q69=1,21,IF(Q69=2,22,IF(Q69=3,23,IF(Q69=4,24,25))))))))","v":22},{"$f":"OFFSET($B$3,R69,0,1,1)","v":"cm³"},{"$f":"OFFSET($C$3,R69,0,1,1)","v":1000},{"$f":"INT(99*(RAND())+1)","v":20},{"$f":"IF(T69>J69,U69*T69/J69,U69*J69/T69)","v":20000},{"$f":"IF(T69>J69,S69,I69)","v":"cm³"},{"$f":"IF(T69>J69,I69,S69)","v":"mm³"},{"$f":"IF(T69<J69,U69*T69/J69,U69*J69/T69)","v":0.02},{"$f":"IF(T69<J69,S69,I69)","v":"mm³"},{"$f":"IF(T69<J69,I69,S69)","v":"cm³"},{"$f":"IF(K69=1,U69,V69)","v":20},{"$f":"IF(K69=1,W69,X69)","v":"cm³"},{"$f":"IF(K69=1,V69,U69)","v":20000},{"$f":"IF(K69=1,X69,W69)","v":"mm³"}]
[null,null,null,67,"67)",2,4,9,"T",1000000000,2,"÷","Mass",1,1,1,1,6,"mg",1,52,52000000000,"T","mg",5.2000000000000002E-8,"mg","T",52000000000,"mg",52,"T"]
[null,null,null,68,"68)",7,1,21,"mm³",1,1,"×","Volume",3,3,3,3,23,"m³",1000000000,61,61000000000,"m³","mm³",6.1000000000000004E-8,"mm³","m³",61,"m³",61000000000,"mm³"]
[null,null,null,69,"69)",4,3,18,"m²",1000000,1,"×","Area",4,4,4,4,19,"ha",10000000000,83,830000,"ha","m²",8.3000000000000001E-3,"m²","ha",83,"ha",830000,"m²"]
[null,null,null,70,"70)",1,2,2,"cm",10,2,"÷","Length",3,3,3,3,3,"m",1000,58,5800,"m","cm",0.57999999999999996,"cm","m",5800,"cm",58,"m"]
[null,null,null,71,"71)",7,1,21,"mm³",1,2,"÷","Volume",2,2,2,2,22,"cm³",1000,44,44000,"cm³","mm³",4.3999999999999997E-2,"mm³","cm³",44000,"mm³",44,"cm³"]
[null,null,null,72,"72)",6,2,22,"cm³",1000,1,"×","Volume",3,3,3,3,23,"m³",1000000000,45,45000000,"m³","cm³",4.5000000000000003E-5,"cm³","m³",45,"m³",45000000,"cm³"]
[null,null,null,73,"73)",3,1,11,"mL",1,2,"÷","Capacity",3,3,3,3,13,"ML",1000000000,21,21000000000,"ML","mL",2.0999999999999999E-8,"mL","ML",21000000000,"mL",21,"ML"]
[null,null,null,74,"74)",7,3,23,"m³",1000000000,1,"×","Volume",1,1,1,1,21,"mm³",1,14,14000000000,"m³","mm³",1.4E-8,"mm³","m³",14,"m³",14000000000,"mm³"]
[null,null,null,75,"75)",4,1,16,"mm²",1,2,"÷","Area",1,5,5,5,20,"km²",1000000000000,74,74000000000000,"km²","mm²",7.4000000000000003E-11,"mm²","km²",74000000000000,"mm²",74,"km²"]
[null,null,null,76,"76)",6,3,23,"m³",1000000000,2,"÷","Volume",2,2,2,2,22,"cm³",1000,62,62000000,"m³","cm³",6.2000000000000003E-5,"cm³","m³",62000000,"cm³",62,"m³"]
[null,null,null,77,"77)",2,4,9,"T",1000000000,1,"×","Mass",3,3,3,3,8,"kg",1000000,27,27000,"T","kg",2.7E-2,"kg","T",27,"T",27000,"kg"]
[null,null,null,78,"78)",6,1,21,"mm³",1,1,"×","Volume",3,3,3,3,23,"m³",1000000000,59,59000000000,"m³","mm³",5.8999999999999999E-8,"mm³","m³",59,"m³",59000000000,"mm³"]
[null,null,null,79,"79)",2,3,8,"kg",1000000,1,"×","Mass",1,1,1,1,6,"mg",1,45,45000000,"kg","mg",4.5000000000000003E-5,"mg","kg",45,"kg",45000000,"mg"]
[null,null,null,80,"80)",5,3,23,"m³",1000000000,2,"÷","Volume",3,3,2,2,22,"cm³",1000,40,40000000,"m³","cm³",4.0000000000000003E-5,"cm³","m³",40000000,"cm³",40,"m³"]
[null,null,null,81,"81)",3,2,12,"L",1000,1,"×","Capacity",3,3,3,3,13,"ML",1000000000,29,29000000,"ML","L",2.9E-5,"L","ML",29,"ML",29000000,"L"]
[null,null,null,82,"82)",2,4,9,"T",1000000000,2,"÷","Mass",4,4,1,1,6,"mg",1,79,79000000000,"T","mg",7.9000000000000006E-8,"mg","T",79000000000,"mg",79,"T"]
[null,null,null,83,"83)",4,4,19,"ha",10000000000,2,"÷","Area",4,1,1,1,16,"mm²",1,52,520000000000,"ha","mm²",5.2000000000000002E-9,"mm²","ha",520000000000,"mm²",52,"ha"]
[null,null,null,84,"84)",2,2,7,"g",1000,2,"÷","Mass",3,3,3,3,8,"kg",1000000,71,71000,"kg","g",7.0999999999999994E-2,"g","kg",71000,"g",71,"kg"]
[null,null,null,85,"85)",1,4,4,"km",1000000,2,"÷","Length",1,1,1,1,1,"mm",1,71,71000000,"km","mm",7.1000000000000005E-5,"mm","km",71000000,"mm",71,"km"]
[null,null,null,86,"86)",8,2,22,"cm³",1000,2,"÷","Volume",3,3,3,3,23,"m³",1000000000,21,21000000,"m³","cm³",2.0999999999999999E-5,"cm³","m³",21000000,"cm³",21,"m³"]
[null,null,null,87,"87)",1,3,3,"m",1000,1,"×","Length",4,4,4,4,4,"km",1000000,81,81000,"km","m",8.1000000000000003E-2,"m","km",81,"km",81000,"m"]
[null,null,null,88,"88)",1,2,2,"cm",10,1,"×","Length",4,4,4,4,4,"km",1000000,30,3000000,"km","cm",2.9999999999999997E-4,"cm","km",30,"km",3000000,"cm"]
[null,null,null,89,"89)",4,1,16,"mm²",1,2,"÷","Area",5,5,5,5,20,"km²",1000000000000,43,43000000000000,"km²","mm²",4.3E-11,"mm²","km²",43000000000000,"mm²",43,"km²"]
[null,null,null,90,"90)",4,1,16,"mm²",1,1,"×","Area",2,2,2,2,17,"cm²",100,84,8400,"cm²","mm²",0.84,"mm²","cm²",84,"cm²",8400,"mm²"]
[null,null,null,91,"91)",3,3,13,"ML",1000000000,1,"×","Capacity",2,2,2,2,12,"L",1000,26,26000000,"ML","L",2.5999999999999998E-5,"L","ML",26,"ML",26000000,"L"]
[null,null,null,92,"92)",3,2,12,"L",1000,1,"×","Capacity",3,3,3,3,13,"ML",1000000000,11,11000000,"ML","L",1.1E-5,"L","ML",11,"ML",11000000,"L"]
[null,null,null,93,"93)",6,1,21,"mm³",1,2,"÷","Volume",1,1,2,2,22,"cm³",1000,3,3000,"cm³","mm³",3.0000000000000001E-3,"mm³","cm³",3000,"mm³",3,"cm³"]
[null,null,null,94,"94)",8,1,21,"mm³",1,1,"×","Volume",3,3,3,3,23,"m³",1000000000,33,33000000000,"m³","mm³",3.2999999999999998E-8,"mm³","m³",33,"m³",33000000000,"mm³"]
[null,null,null,95,"95)",2,2,7,"g",1000,2,"÷","Mass",1,1,1,1,6,"mg",1,79,79000,"g","mg",7.9000000000000001E-2,"mg","g",79000,"mg",79,"g"]
[null,null,null,96,"96)",2,1,6,"mg",1,1,"×","Mass",3,3,3,3,8,"kg",1000000,53,53000000,"kg","mg",5.3000000000000001E-5,"mg","kg",53,"kg",53000000,"mg"]
[null,null,null,97,"97)",7,1,21,"mm³",1,2,"÷","Volume",1,1,1,2,22,"cm³",1000,88,88000,"cm³","mm³",8.7999999999999995E-2,"mm³","cm³",88000,"mm³",88,"cm³"]
[null,null,null,98,"98)",5,2,22,"cm³",1000,2,"÷","Volume",2,2,1,1,21,"mm³",1,37,37000,"cm³","mm³",3.6999999999999998E-2,"mm³","cm³",37000,"mm³",37,"cm³"]
[null,null,null,99,"99)",7,2,22,"cm³",1000,1,"×","Volume",1,1,1,1,21,"mm³",1,14,14000,"cm³","mm³",1.4E-2,"mm³","cm³",14,"cm³",14000,"mm³"]
[null,null,null,100,"100)",2,3,8,"kg",1000000,1,"×","Mass",2,2,2,2,7,"g",1000,99,99000,"kg","g",9.9000000000000005E-2,"g","kg",99,"kg",99000,"g"]