{"text_format":"1","workbook":"xlsx","n_sheets":4,"sheets":["Select","Working","Worksheet","Answers"],"not_rendered":{"charts":0,"images":4,"macros":1,"external_links":0,"defined_names":0,"comments":0,"pivot_tables":0},"unopened":[],"bounds":{"document_bytes":16777216,"sheet_cells":100000,"rows_first":2000,"rows_last":500,"rows_between":2000,"halvings":0,"cell_chars":16384,"cell_head_chars":4096},"cells_cut":0,"cells_raw":0,"read":"whole","date_system":"1900"}

{"sheet":"Select","index":0,"n_rows":11,"n_cols":8,"rows_kept":11,"cut":false,"hidden":false,"merged":[[0,1,0,6],[10,2,13,7],[4,7,7,8],[9,2,9,6],[1,2,1,6],[3,2,3,7],[4,2,4,4]]}
[null,"MONIC BINOMIAL EXPANSIONS"]
[null,null,"INSTRUCTIONS"]
[]
[null,"Step 1","Select Desired type of Binomial Expansion"]
[null,null,null,null,null,null,null,"PRESS F9 for NEW WorkSheet"]
[]
[]
[]
[]
[null,"Step 2","Click on Select tab below to choose different WorkSheet."]
[null,"Note","If you click on the WorkSheet tab then hold down shift and click on the Solutions tab, you will be able to print both the WorkSheet and the solutions."]

{"sheet":"Working","index":1,"n_rows":77,"n_cols":66,"rows_kept":77,"cut":false,"hidden":true,"merged":[]}
[null,{"$f":"INT(900*RAND()+100)","v":939},{"$f":"TEXT(1,B1)","v":"939"},"QT-",null,null,"aX(bY+cZ)",null,"(bY+cZ)(AY+dZ)",null,"\"=b^2Y\"^2=2*b*c*YZ+c^2Z^2",null,null,null,null,null,null,null,null,null,null,null,null,{"$f":"IF(U1=1,\"\",TEXT(U1,U1))","v":""},null,null,null,null,null,null,null,null,null,null,null,null,null,null,null,null,null,null,null,null,null,null,null,null,null,null,null,null,null,null,null,"Binomial Expansions - 1",null,null,"Perfect squares - 2",null,null,"Difference of 2 squares - 3"]
[null,null,"Y",null,null,"Z",null,null,null,"a",null,null,null,"b",null,null,null,null,null,null,null,null,null,"c",null,null,null,"d",null,null,null,null,null,null,null,null,null,null,"d",null,"b^2",null,"c^2",null,"bd+ac",null,"Sign","cd",null,"Sign","Sign c2",null,"Questions","Random Question",null,"Expansion","Factorisation"]
[1,{"$f":"INT(24*RAND()+97)","v":99},{"$f":"IF(B3=108,CHAR(B3+1),CHAR(B3))","v":"c"},{"$f":"INT(24*RAND()+97)","v":105},{"$f":"IF(D3=B3, D3+1,IF(D3=C3,D3+1,D3))","v":105},{"$f":"IF(E3=108,CHAR(E3+1),CHAR(E3))","v":"i"},1,0,{"$f":"IF(H3=0,\"\",\"-\")","v":""},{"$f":"IF(G3=1,\"\",TEXT(G3,G3))","v":""},1,0,{"$f":"IF(L3=0,\"\",\"-\")","v":""},{"$f":"IF(K3=1,\"\",TEXT(K3,K3))","v":""},{"$f":"INT(12*RAND()+1)","v":8},{"$f":"IF(O3=1,1,(IF(AND(INT(K3/2)=K3/2,INT(O3/2)=O3/2),O3+1,O3)))","v":8},{"$f":"IF(AND(INT(K3/3)=K3/3,INT(P3/3)=P3/3 ),P3+1,P3)","v":8},{"$f":"IF(AND(INT(K3/4)=K3/4,INT(Q3/4)=Q3/4 ),Q3+1,Q3)","v":8},{"$f":"IF(AND(INT($K3/5)=$K3/5,INT($R3/5)=$R3/5 ),$R3+1,$R3)","v":8},{"$f":"IF(AND(INT($K3/7)=$K3/7,INT($S3/7)=$S3/7 ),$S3+1,$S3)","v":8},{"$f":"IF(AND(INT(K3/2)=K3/2,INT(T3/2)=T3/2 ),T3+1,T3)","v":8},0,{"$f":"IF(V3=0,\" + \",\" - \")","v":" + "},{"$f":"TEXT(U3,0)","v":"8"},1,0,{"$f":"IF(Z3=0,\"\",\"-\")","v":""},{"$f":"IF(Y3=1,\"\",TEXT(Y3,Y3))","v":""},{"$f":"INT(12*RAND()+1)","v":8},{"$f":"IF(AC3=1,1,(IF(AND(INT(G3/2)=G3/2,INT(AC3/2)=AC3/2),AC3+1,AC3)))","v":8},{"$f":"IF(AND(INT(G3/3)=G3/3,INT(AD3/3)=AD3/3 ),AD3+1,AD3)","v":8},{"$f":"IF(AND(INT(G3/4)=G3/4,INT(AE3/4)=AE3/4 ),AE3+1,AE3)","v":8},{"$f":"IF(AND(INT(G3/5)=G3/5,INT($AF3/5)=$AF3/5 ),$AF3+1,$AF3)","v":8},{"$f":"IF(AND(INT($G3/7)=$G3/7,INT($AG3/7)=$AG3/7 ),$AG3+1,$AG3)","v":8},{"$f":"IF(AND(INT(G3/2)=G3/2,INT(AH3/2)=AH3/2 ),AH3+1,AH3)","v":8},0,0,{"$f":"IF(AK3=0,\" + \",\" - \")","v":" + "},{"$f":"TEXT(AI3,0)","v":"8"},null,{"$f":"K3^2","v":1},{"$f":"IF(AO3=1,\"\",TEXT(AO3,0))","v":""},{"$f":"U3^2","v":64},{"$f":"IF(AQ3=1,\"\",TEXT(AQ3,0))","v":"64"},{"$f":"(-1)^(L3+1)*K3*(-1)^(AK3+1)*AI3+(-1)^(V3+1)*U3*(-1)^(H3+1)*G3","v":16},{"$f":"IF(ABS(AS3)=1,\"\",TEXT(ABS(AS3),0))","v":"16"},{"$f":"IF(AS3<1,\" - \",\" + \")","v":" + "},{"$f":"(-1)^(AK3+1)*AI3*(-1)^(V3+1)*U3","v":64},{"$f":"TEXT(ABS(AV3),0)","v":"64"},{"$f":"IF(AV3<1,\" - \",\" + \")","v":" + "},{"$f":"IF(V3=0,\" - \",\" + \")","v":" - "},null,null,{"$f":"3*INT(3*RAND())","v":3},null,{"$f":"CONCATENATE(\"(\",$N3,$C3,$W3,$X3,,\")\",\"(\",$J3,$C3,$AL3,$AM3,,\")\",\" =\")","v":"(c + 8)(c + 8) ="},{"$f":"CONCATENATE($C3,CHAR(178),$AU3,$AT3,$M3,$C3,$AX3,$AW3)","v":"c² + 16c + 64"},null,{"$f":"CONCATENATE(\"(\",$M3,$N3,$C3,$W3,$X3,,\")\",CHAR(178),\" =\")","v":"(c + 8)² ="},{"$f":"CONCATENATE($C3,CHAR(178),$W3,2*$U3,$M3,$C3,\" + \",($X3)^2)","v":"c² + 16c + 64"},null,{"$f":"CONCATENATE(\"(\",$N3,$C3,$W3,$X3,,\")\",\"(\",$N3,$C3,$AY3,$X3,,\")\",\" =\")","v":"(c + 8)(c - 8) ="},{"$f":"CONCATENATE($C3,CHAR(178),\" - \",($U3)^2)","v":"c² - 64"},null,{"$f":"OFFSET(BD3,0,VALUE(BB3))","v":"(c + 8)² ="},{"$f":"OFFSET(BE3,0,VALUE(BB3))","v":"c² + 16c + 64"}]
[2,{"$f":"INT(24*RAND()+97)","v":111},{"$f":"IF(B4=108,CHAR(B4+1),CHAR(B4))","v":"o"},{"$f":"INT(24*RAND()+97)","v":99},{"$f":"IF(D4=B4, D4+1,IF(D4=C4,D4+1,D4))","v":99},{"$f":"IF(E4=108,CHAR(E4+1),CHAR(E4))","v":"c"},1,0,"",{"$f":"IF(G4=1,\"\",TEXT(G4,G4))","v":""},1,0,{"$f":"IF(L4=0,\"\",\"-\")","v":""},{"$f":"IF(K4=1,\"\",TEXT(K4,K4))","v":""},{"$f":"INT(12*RAND()+1)","v":5},{"$f":"IF(O4=1,1,(IF(AND(INT(K4/2)=K4/2,INT(O4/2)=O4/2),O4+1,O4)))","v":5},{"$f":"IF(AND(INT(K4/3)=K4/3,INT(P4/3)=P4/3 ),P4+1,P4)","v":5},{"$f":"IF(AND(INT(K4/4)=K4/4,INT(Q4/4)=Q4/4 ),Q4+1,Q4)","v":5},{"$f":"IF(AND(INT(K4/5)=K4/5,INT(R4/5)=R4/5 ),R4+1,R4)","v":5},{"$f":"IF(AND(INT($K4/7)=$K4/7,INT($S4/7)=$S4/7 ),$S4+1,$S4)","v":5},{"$f":"IF(AND(INT(K4/2)=K4/2,INT(T4/2)=T4/2 ),T4+1,T4)","v":5},0,{"$f":"IF(V4=0,\" + \",\" - \")","v":" + "},{"$f":"TEXT(U4,0)","v":"5"},1,0,{"$f":"IF(Z4=0,\"\",\"-\")","v":""},{"$f":"IF(Y4=1,\"\",TEXT(Y4,Y4))","v":""},{"$f":"INT(12*RAND()+1)","v":1},{"$f":"IF(AC4=1,1,(IF(AND(INT(G4/2)=G4/2,INT(AC4/2)=AC4/2),AC4+1,AC4)))","v":1},{"$f":"IF(AND(INT(G4/3)=G4/3,INT(AD4/3)=AD4/3 ),AD4+1,AD4)","v":1},{"$f":"IF(AND(INT(G4/4)=G4/4,INT(AE4/4)=AE4/4 ),AE4+1,AE4)","v":1},{"$f":"IF(AND(INT(G4/5)=G4/5,INT($AF4/5)=$AF4/5 ),$AF4+1,$AF4)","v":1},{"$f":"IF(AND(INT($G4/7)=$G4/7,INT($AG4/7)=$AG4/7 ),$AG4+1,$AG4)","v":1},{"$f":"IF(AND(INT(G4/2)=G4/2,INT(AH4/2)=AH4/2 ),AH4+1,AH4)","v":1},0,0,{"$f":"IF(AK4=0,\" + \",\" - \")","v":" + "},{"$f":"TEXT(AI4,0)","v":"1"},null,{"$f":"K4^2","v":1},{"$f":"IF(AO4=1,\"\",TEXT(AO4,0))","v":""},{"$f":"U4^2","v":25},{"$f":"IF(AQ4=1,\"\",TEXT(AQ4,0))","v":"25"},{"$f":"(-1)^(L4+1)*K4*(-1)^(AK4+1)*AI4+(-1)^(V4+1)*U4*(-1)^(H4+1)*G4","v":6},{"$f":"IF(ABS(AS4)=1,\"\",TEXT(ABS(AS4),0))","v":"6"},{"$f":"IF(AS4<1,\" - \",\" + \")","v":" + "},{"$f":"(-1)^(AK4+1)*AI4*(-1)^(V4+1)*U4","v":5},{"$f":"TEXT(ABS(AV4),0)","v":"5"},{"$f":"IF(AV4<1,\" - \",\" + \")","v":" + "},{"$f":"IF(V4=0,\" - \",\" + \")","v":" - "},null,null,3,null,{"$f":"CONCATENATE(\"(\",$N4,$C4,$W4,$X4,,\")\",\"(\",$J4,$C4,$AL4,$AM4,,\")\",\" =\")","v":"(o + 5)(o + 1) ="},{"$f":"CONCATENATE($C4,CHAR(178),$AU4,$AT4,$M4,$C4,$AX4,$AW4)","v":"o² + 6o + 5"},null,{"$f":"CONCATENATE(\"(\",$M4,$N4,$C4,$W4,$X4,,\")\",CHAR(178),\" =\")","v":"(o + 5)² ="},{"$f":"CONCATENATE($C4,CHAR(178),$W4,2*$U4,$M4,$C4,\" + \",($X4)^2)","v":"o² + 10o + 25"},null,{"$f":"CONCATENATE(\"(\",$N4,$C4,$W4,$X4,,\")\",\"(\",$N4,$C4,$AY4,$X4,,\")\",\" =\")","v":"(o + 5)(o - 5) ="},{"$f":"CONCATENATE($C4,CHAR(178),\" - \",($U4)^2)","v":"o² - 25"},null,"(o + 5)² =","o² + 10o + 25"]
[3,98,"b",108,108,"m",1,0,"","",1,0,"","",2,2,2,2,2,{"$f":"IF(AND(INT($K5/7)=$K5/7,INT($S5/7)=$S5/7 ),$S5+1,$S5)","v":2},{"$f":"IF(AND(INT(K5/2)=K5/2,INT(T5/2)=T5/2 ),T5+1,T5)","v":2},0," + ",{"$f":"TEXT(U5,0)","v":"2"},1,0,"","",10,10,10,10,10,{"$f":"IF(AND(INT($G5/7)=$G5/7,INT($AG5/7)=$AG5/7 ),$AG5+1,$AG5)","v":10},10,0,0," + ",{"$f":"TEXT(AI5,0)","v":"10"},null,1,"",4,"4",12,"12"," + ",20,"20"," + "," - ",null,null,6,null,"(b + 2)(b + 10) =","b² + 12b + 20",null,"(b + 2)² =","b² + 4b + 4",null,"(b + 2)(b - 2) =","b² - 4",null,"(b + 2)(b - 2) =","b² - 4"]
[4,108,"m",105,105,"i",1,0,"","",1,0,"","",5,5,5,5,5,5,5,0," + ","5",1,0,"","",12,12,12,12,12,12,12,0,0," + ","12",null,1,"",25,"25",17,"17"," + ",60,"60"," + "," - ",null,null,3,null,"(m + 5)(m + 12) =","m² + 17m + 60",null,"(m + 5)² =","m² + 10m + 25",null,"(m + 5)(m - 5) =","m² - 25",null,"(m + 5)² =","m² + 10m + 25"]
[5,105,"i",100,100,"d",1,0,"","",1,0,"","",3,3,3,3,3,3,3,0," + ","3",1,0,"","",4,4,4,4,4,4,4,0,0," + ","4",null,1,"",9,"9",7,"7"," + ",12,"12"," + "," - ",null,null,3,null,"(i + 3)(i + 4) =","i² + 7i + 12",null,"(i + 3)² =","i² + 6i + 9",null,"(i + 3)(i - 3) =","i² - 9",null,"(i + 3)² =","i² + 6i + 9"]
[6,116,"t",108,108,"m",1,0,"","",1,0,"","",7,7,7,7,7,7,7,0," + ","7",1,0,"","",4,4,4,4,4,4,4,0,0," + ","4",null,1,"",49,"49",11,"11"," + ",28,"28"," + "," - ",null,null,6,null,"(t + 7)(t + 4) =","t² + 11t + 28",null,"(t + 7)² =","t² + 14t + 49",null,"(t + 7)(t - 7) =","t² - 49",null,"(t + 7)(t - 7) =","t² - 49"]
[7,111,"o",106,106,"j",1,0,"","",1,0,"","",11,11,11,11,11,11,11,0," + ","11",1,0,"","",7,7,7,7,7,7,7,0,0," + ","7",null,1,"",121,"121",18,"18"," + ",77,"77"," + "," - ",null,null,3,null,"(o + 11)(o + 7) =","o² + 18o + 77",null,"(o + 11)² =","o² + 22o + 121",null,"(o + 11)(o - 11) =","o² - 121",null,"(o + 11)² =","o² + 22o + 121"]
[8,120,"x",112,112,"p",1,0,"","",1,0,"","",8,8,8,8,8,8,8,0," + ","8",1,0,"","",12,12,12,12,12,12,12,0,0," + ","12",null,1,"",64,"64",20,"20"," + ",96,"96"," + "," - ",null,null,6,null,"(x + 8)(x + 12) =","x² + 20x + 96",null,"(x + 8)² =","x² + 16x + 64",null,"(x + 8)(x - 8) =","x² - 64",null,"(x + 8)(x - 8) =","x² - 64"]
[9,115,"s",114,114,"r",1,0,"","",1,0,"","",6,6,6,6,6,6,6,0," + ","6",1,0,"","",10,10,10,10,10,10,10,0,0," + ","10",null,1,"",36,"36",16,"16"," + ",60,"60"," + "," - ",null,null,3,null,"(s + 6)(s + 10) =","s² + 16s + 60",null,"(s + 6)² =","s² + 12s + 36",null,"(s + 6)(s - 6) =","s² - 36",null,"(s + 6)² =","s² + 12s + 36"]
[10,109,"m",105,105,"i",1,0,"","",1,0,"","",1,1,1,1,1,1,1,0," + ","1",1,0,"","",1,1,1,1,1,1,1,0,0," + ","1",null,1,"",1,"",2,"2"," + ",1,"1"," + "," - ",null,null,6,null,"(m + 1)(m + 1) =","m² + 2m + 1",null,"(m + 1)² =","m² + 2m + 1",null,"(m + 1)(m - 1) =","m² - 1",null,"(m + 1)(m - 1) =","m² - 1"]
[11,108,"m",110,110,"n",1,0,"","",1,0,"","",12,12,12,12,12,12,12,1," - ","12",1,0,"","",12,12,12,12,12,12,12,1,1," - ","12",null,1,"",144,"144",-24,"24"," - ",144,"144"," + "," + ",null,null,3,null,"(m - 12)(m - 12) =","m² - 24m + 144",null,"(m - 12)² =","m² - 24m + 144",null,"(m - 12)(m + 12) =","m² - 144",null,"(m - 12)² =","m² - 24m + 144"]
[12,109,"m",104,104,"h",1,0,"","",1,0,"","",5,5,5,5,5,5,5,1," - ","5",1,0,"","",3,3,3,3,3,3,3,1,1," - ","3",null,1,"",25,"25",-8,"8"," - ",15,"15"," + "," + ",null,null,0,null,"(m - 5)(m - 3) =","m² - 8m + 15",null,"(m - 5)² =","m² - 10m + 25",null,"(m - 5)(m + 5) =","m² - 25",null,"(m - 5)(m - 3) =","m² - 8m + 15"]
[13,101,"e",114,114,"r",1,0,"","",1,0,"","",6,6,6,6,6,6,6,1," - ","6",1,0,"","",3,3,3,3,3,3,3,1,1," - ","3",null,1,"",36,"36",-9,"9"," - ",18,"18"," + "," + ",null,null,3,null,"(e - 6)(e - 3) =","e² - 9e + 18",null,"(e - 6)² =","e² - 12e + 36",null,"(e - 6)(e + 6) =","e² - 36",null,"(e - 6)² =","e² - 12e + 36"]
[14,100,"d",107,107,"k",1,0,"","",1,0,"","",8,8,8,8,8,8,8,1," - ","8",1,0,"","",9,9,9,9,9,9,9,1,1," - ","9",null,1,"",64,"64",-17,"17"," - ",72,"72"," + "," + ",null,null,3,null,"(d - 8)(d - 9) =","d² - 17d + 72",null,"(d - 8)² =","d² - 16d + 64",null,"(d - 8)(d + 8) =","d² - 64",null,"(d - 8)² =","d² - 16d + 64"]
[15,106,"j",115,115,"s",1,0,"","",1,0,"","",11,11,11,11,11,11,11,1," - ","11",1,0,"","",3,3,3,3,3,3,3,1,1," - ","3",null,1,"",121,"121",-14,"14"," - ",33,"33"," + "," + ",null,null,0,null,"(j - 11)(j - 3) =","j² - 14j + 33",null,"(j - 11)² =","j² - 22j + 121",null,"(j - 11)(j + 11) =","j² - 121",null,"(j - 11)(j - 3) =","j² - 14j + 33"]
[16,120,"x",113,113,"q",1,0,"","",1,0,"","",6,6,6,6,6,6,6,1," - ","6",1,0,"","",5,5,5,5,5,5,5,1,1," - ","5",null,1,"",36,"36",-11,"11"," - ",30,"30"," + "," + ",null,null,0,null,"(x - 6)(x - 5) =","x² - 11x + 30",null,"(x - 6)² =","x² - 12x + 36",null,"(x - 6)(x + 6) =","x² - 36",null,"(x - 6)(x - 5) =","x² - 11x + 30"]
[17,100,"d",110,110,"n",1,0,"","",1,0,"","",2,2,2,2,2,2,2,1," - ","2",1,0,"","",12,12,12,12,12,12,12,1,1," - ","12",null,1,"",4,"4",-14,"14"," - ",24,"24"," + "," + ",null,null,3,null,"(d - 2)(d - 12) =","d² - 14d + 24",null,"(d - 2)² =","d² - 4d + 4",null,"(d - 2)(d + 2) =","d² - 4",null,"(d - 2)² =","d² - 4d + 4"]
[18,101,"e",99,99,"c",1,0,"","",1,0,"","",1,1,1,1,1,1,1,1," - ","1",1,0,"","",12,12,12,12,12,12,12,1,1," - ","12",null,1,"",1,"",-13,"13"," - ",12,"12"," + "," + ",null,null,6,null,"(e - 1)(e - 12) =","e² - 13e + 12",null,"(e - 1)² =","e² - 2e + 1",null,"(e - 1)(e + 1) =","e² - 1",null,"(e - 1)(e + 1) =","e² - 1"]
[19,110,"n",99,99,"c",1,0,"","",1,0,"","",11,11,11,11,11,11,11,1," - ","11",1,0,"","",4,4,4,4,4,4,4,1,1," - ","4",null,1,"",121,"121",-15,"15"," - ",44,"44"," + "," + ",null,null,6,null,"(n - 11)(n - 4) =","n² - 15n + 44",null,"(n - 11)² =","n² - 22n + 121",null,"(n - 11)(n + 11) =","n² - 121",null,"(n - 11)(n + 11) =","n² - 121"]
[20,99,"c",98,98,"b",1,0,"","",1,0,"","",11,11,11,11,11,11,11,1," - ","11",1,0,"","",11,11,11,11,11,11,11,1,1," - ","11",null,1,"",121,"121",-22,"22"," - ",121,"121"," + "," + ",null,null,3,null,"(c - 11)(c - 11) =","c² - 22c + 121",null,"(c - 11)² =","c² - 22c + 121",null,"(c - 11)(c + 11) =","c² - 121",null,"(c - 11)² =","c² - 22c + 121"]
[21,104,"h",97,97,"a",1,0,"","",1,0,"","",2,2,2,2,2,2,2,{"$f":"INT(2*RAND())","v":0}," + ","2",1,0,"","",10,10,10,10,10,10,10,{"$f":"INT(2*RAND())","v":0},{"$f":"IF((AND(AI23=U23,MOD(AJ23+1,2)=V23)),MOD(AJ23+1,2),AJ23)","v":0}," + ","10",null,1,"",4,"4",12,"12"," + ",20,"20"," + "," - ",null,null,0,null,"(h + 2)(h + 10) =","h² + 12h + 20",null,"(h + 2)² =","h² + 4h + 4",null,"(h + 2)(h - 2) =","h² - 4",null,"(h + 2)(h + 10) =","h² + 12h + 20"]
[22,112,"p",108,108,"m",1,0,"","",1,0,"","",1,1,1,1,1,1,1,0," + ","1",1,0,"","",6,6,6,6,6,6,6,1,{"$f":"IF((AND(AI24=U24,MOD(AJ24+1,2)=V24)),MOD(AJ24+1,2),AJ24)","v":1}," - ","6",null,1,"",1,"",-5,"5"," - ",-6,"6"," - "," - ",null,null,6,null,"(p + 1)(p - 6) =","p² - 5p - 6",null,"(p + 1)² =","p² + 2p + 1",null,"(p + 1)(p - 1) =","p² - 1",null,"(p + 1)(p - 1) =","p² - 1"]
[23,97,"a",99,99,"c",1,0,"","",1,0,"","",3,3,3,3,3,3,3,0," + ","3",1,0,"","",10,10,10,10,10,10,10,0,0," + ","10",null,1,"",9,"9",13,"13"," + ",30,"30"," + "," - ",null,null,0,null,"(a + 3)(a + 10) =","a² + 13a + 30",null,"(a + 3)² =","a² + 6a + 9",null,"(a + 3)(a - 3) =","a² - 9",null,"(a + 3)(a + 10) =","a² + 13a + 30"]
[24,119,"w",108,108,"m",1,0,"","",1,0,"","",5,5,5,5,5,5,5,1," - ","5",1,0,"","",6,6,6,6,6,6,6,1,1," - ","6",null,1,"",25,"25",-11,"11"," - ",30,"30"," + "," + ",null,null,3,null,"(w - 5)(w - 6) =","w² - 11w + 30",null,"(w - 5)² =","w² - 10w + 25",null,"(w - 5)(w + 5) =","w² - 25",null,"(w - 5)² =","w² - 10w + 25"]
[25,112,"p",99,99,"c",1,0,"","",1,0,"","",1,1,1,1,1,1,1,0," + ","1",1,0,"","",8,8,8,8,8,8,8,0,0," + ","8",null,1,"",1,"",9,"9"," + ",8,"8"," + "," - ",null,null,0,null,"(p + 1)(p + 8) =","p² + 9p + 8",null,"(p + 1)² =","p² + 2p + 1",null,"(p + 1)(p - 1) =","p² - 1",null,"(p + 1)(p + 8) =","p² + 9p + 8"]
[26,114,"r",103,103,"g",1,0,"","",1,0,"","",{"$f":"INT(7*RAND()+1)","v":2},2,2,2,2,2,2,1," - ","2",{"$f":"INT(8*RAND()+2)","v":6},0,"","6",7,7,7,7,7,7,7,0,0," + ","7",null,1,"",4,"4",5,"5"," + ",-14,"14"," - "," + ",null,null,3,null,{"$f":"CONCATENATE(\"(\",$N28,$C28,$W28,$X28,,\")\",\"(\",$J28,$C28,$AL28,$AM28,\")\",\" =\")","v":"(r - 2)(r + 7) ="},{"$f":"CONCATENATE($C28,CHAR(178),$AU28,$AT28,$C28,$AX28,$AW28)","v":"r² + 5r - 14"},null,{"$f":"CONCATENATE(\"(\",$M28,$N28,$C28,$W28,$X28,,\")\",CHAR(178),\" =\")","v":"(r - 2)² ="},{"$f":"CONCATENATE($AP28,$C28,CHAR(178),$W28,2*$U28*$K28,$C28,\" + \",$AQ28)","v":"r² - 4r + 4"},null,{"$f":"CONCATENATE(\"(\",$N28,$C28,$W28,$X28,,\")\",\"(\",$N28,$C28,$AY28,$X28,,\")\",\" =\")","v":"(r - 2)(r + 2) ="},{"$f":"CONCATENATE($AP28,$C28,CHAR(178),\" - \",($X28)^2)","v":"r² - 4"},null,"(r - 2)² =","r² - 4r + 4"]
[27,117,"u",113,113,"q",1,0,"","",1,0,"","",5,5,5,5,5,5,5,0," + ","5",{"$f":"INT(8*RAND()+2)","v":7},0,"","7",12,12,12,12,12,12,12,1,1," - ","12",null,1,"",25,"25",-7,"7"," - ",-60,"60"," - "," - ",null,null,6,null,{"$f":"CONCATENATE(\"(\",$N29,$C29,$W29,$X29,,\")\",\"(\",$J29,$C29,$AL29,$AM29,\")\",\" =\")","v":"(u + 5)(u - 12) ="},{"$f":"CONCATENATE($C29,CHAR(178),$AU29,$AT29,$C29,$AX29,$AW29)","v":"u² - 7u - 60"},null,{"$f":"CONCATENATE(\"(\",$M29,$N29,$C29,$W29,$X29,,\")\",CHAR(178),\" =\")","v":"(u + 5)² ="},{"$f":"CONCATENATE($AP29,$C29,CHAR(178),$W29,2*$U29*$K29,$C29,\" + \",$AQ29)","v":"u² + 10u + 25"},null,{"$f":"CONCATENATE(\"(\",$N29,$C29,$W29,$X29,,\")\",\"(\",$N29,$C29,$AY29,$X29,,\")\",\" =\")","v":"(u + 5)(u - 5) ="},{"$f":"CONCATENATE($AP29,$C29,CHAR(178),\" - \",($X29)^2)","v":"u² - 25"},null,"(u + 5)(u - 5) =","u² - 25"]
[28,97,"a",104,104,"h",1,0,"","",1,0,"","",5,5,5,5,5,5,5,0," + ","5",8,0,"","8",2,2,2,2,2,2,2,1,1," - ","2",null,1,"",25,"25",3,"3"," + ",-10,"10"," - "," - ",null,null,0,null,"(a + 5)(a - 2) =","a² + 3a - 10",null,"(a + 5)² =","a² + 10a + 25",null,"(a + 5)(a - 5) =","a² - 25",null,"(a + 5)(a - 2) =","a² + 3a - 10"]
[29,100,"d",114,114,"r",1,0,"","",1,0,"","",7,7,7,7,7,7,7,1," - ","7",8,0,"","8",11,11,11,11,11,11,11,1,1," - ","11",null,1,"",49,"49",-18,"18"," - ",77,"77"," + "," + ",null,null,6,null,"(d - 7)(d - 11) =","d² - 18d + 77",null,"(d - 7)² =","d² - 14d + 49",null,"(d - 7)(d + 7) =","d² - 49",null,"(d - 7)(d + 7) =","d² - 49"]
[30,103,"g",108,108,"m",1,0,"","",1,0,"","",1,1,1,1,1,1,1,1," - ","1",8,0,"","8",4,4,4,4,4,4,4,0,0," + ","4",null,1,"",1,"",3,"3"," + ",-4,"4"," - "," + ",null,null,0,null,"(g - 1)(g + 4) =","g² + 3g - 4",null,"(g - 1)² =","g² - 2g + 1",null,"(g - 1)(g + 1) =","g² - 1",null,"(g - 1)(g + 4) =","g² + 3g - 4"]
[31,100,"d",111,111,"o",1,0,"","",1,0,"","",6,6,6,6,6,6,6,0," + ","6",4,0,"","4",1,1,1,1,1,1,1,0,0," + ","1",null,1,"",36,"36",7,"7"," + ",6,"6"," + "," - ",null,null,3,null,"(d + 6)(d + 1) =","d² + 7d + 6",null,"(d + 6)² =","d² + 12d + 36",null,"(d + 6)(d - 6) =","d² - 36",null,"(d + 6)² =","d² + 12d + 36"]
[32,117,"u",115,115,"s",1,0,"","",1,0,"","",6,6,6,6,6,6,6,0," + ","6",8,0,"","8",5,5,5,5,5,5,5,0,0," + ","5",null,1,"",36,"36",11,"11"," + ",30,"30"," + "," - ",null,null,6,null,"(u + 6)(u + 5) =","u² + 11u + 30",null,"(u + 6)² =","u² + 12u + 36",null,"(u + 6)(u - 6) =","u² - 36",null,"(u + 6)(u - 6) =","u² - 36"]
[33,107,"k",114,114,"r",1,0,{"$f":"IF(H35=0,\"\",\"-\")","v":""},"",1,0,"","",3,3,3,3,3,3,3,{"$f":"INT(2*RAND())","v":0}," + ","3",3,0,"","3",2,2,2,2,2,2,2,1,1," - ","2",null,1,"",9,"9",1,""," + ",-6,"6"," - "," - ",null,null,{"$f":"3*INT(3*RAND())","v":6},null,"(k + 3)(k - 2) =","k² + k - 6",null,"(k + 3)² =","k² + 6k + 9",null,"(k + 3)(k - 3) =","k² - 9",null,{"$f":"OFFSET(BD35,0,VALUE(BB35))","v":"(k + 3)(k - 3) ="},{"$f":"OFFSET(BE35,0,VALUE(BB35))","v":"k² - 9"}]
[34,110,"n",104,104,"h",1,0,"","",1,0,"","",7,7,7,7,7,7,7,0," + ","7",5,0,"","5",3,3,3,3,3,3,3,1,1," - ","3",null,1,"",49,"49",4,"4"," + ",-21,"21"," - "," - ",null,null,0,null,"(n + 7)(n - 3) =","n² + 4n - 21",null,"(n + 7)² =","n² + 14n + 49",null,"(n + 7)(n - 7) =","n² - 49",null,"(n + 7)(n - 3) =","n² + 4n - 21"]
[35,107,"k",108,108,"m",1,0,"","",1,0,"","",3,3,3,3,3,3,3,0," + ","3",8,0,"","8",7,7,7,7,7,7,7,0,0," + ","7",null,1,"",9,"9",10,"10"," + ",21,"21"," + "," - ",null,null,3,null,"(k + 3)(k + 7) =","k² + 10k + 21",null,"(k + 3)² =","k² + 6k + 9",null,"(k + 3)(k - 3) =","k² - 9",null,"(k + 3)² =","k² + 6k + 9"]
[36,109,"m",113,113,"q",1,0,"","",1,0,"","",5,5,5,5,5,5,5,1," - ","5",9,0,"","9",3,3,3,3,3,3,3,1,1," - ","3",null,1,"",25,"25",-8,"8"," - ",15,"15"," + "," + ",null,null,6,null,"(m - 5)(m - 3) =","m² - 8m + 15",null,"(m - 5)² =","m² - 10m + 25",null,"(m - 5)(m + 5) =","m² - 25",null,"(m - 5)(m + 5) =","m² - 25"]
[37,113,"q",116,116,"t",1,0,"","",1,0,"","",2,2,2,2,2,2,2,1," - ","2",6,0,"","6",5,5,5,5,5,5,5,1,1," - ","5",null,1,"",4,"4",-7,"7"," - ",10,"10"," + "," + ",null,null,3,null,"(q - 2)(q - 5) =","q² - 7q + 10",null,"(q - 2)² =","q² - 4q + 4",null,"(q - 2)(q + 2) =","q² - 4",null,"(q - 2)² =","q² - 4q + 4"]
[38,116,"t",104,104,"h",1,0,"","",1,0,"","",7,7,7,7,7,7,7,1," - ","7",5,0,"","5",5,5,5,5,5,5,5,1,1," - ","5",null,1,"",49,"49",-12,"12"," - ",35,"35"," + "," + ",null,null,6,null,"(t - 7)(t - 5) =","t² - 12t + 35",null,"(t - 7)² =","t² - 14t + 49",null,"(t - 7)(t + 7) =","t² - 49",null,"(t - 7)(t + 7) =","t² - 49"]
[39,115,"s",98,98,"b",1,0,"","",1,0,"","",4,4,4,4,4,4,4,0," + ","4",4,0,"","4",9,9,9,9,9,9,9,1,1," - ","9",null,1,"",16,"16",-5,"5"," - ",-36,"36"," - "," - ",null,null,3,null,"(s + 4)(s - 9) =","s² - 5s - 36",null,"(s + 4)² =","s² + 8s + 16",null,"(s + 4)(s - 4) =","s² - 16",null,"(s + 4)² =","s² + 8s + 16"]
[40,113,"q",117,117,"u",1,0,"","",1,0,"","",1,1,1,1,1,1,1,1," - ","1",4,0,"","4",9,9,9,9,9,9,9,0,0," + ","9",null,1,"",1,"",8,"8"," + ",-9,"9"," - "," + ",null,null,0,null,"(q - 1)(q + 9) =","q² + 8q - 9",null,"(q - 1)² =","q² - 2q + 1",null,"(q - 1)(q + 1) =","q² - 1",null,"(q - 1)(q + 9) =","q² + 8q - 9"]
[41,108,"m",111,111,"o",1,0,"","",1,0,"","",3,3,3,3,3,3,3,1," - ","3",6,0,"","6",12,12,12,12,12,12,12,0,0," + ","12",null,1,"",9,"9",9,"9"," + ",-36,"36"," - "," + ",null,null,3,null,"(m - 3)(m + 12) =","m² + 9m - 36",null,"(m - 3)² =","m² - 6m + 9",null,"(m - 3)(m + 3) =","m² - 9",null,"(m - 3)² =","m² - 6m + 9"]
[42,106,"j",119,119,"w",1,0,"","",1,0,"","",5,5,5,5,5,5,5,1," - ","5",6,0,"","6",11,11,11,11,11,11,11,0,0," + ","11",null,1,"",25,"25",6,"6"," + ",-55,"55"," - "," + ",null,null,6,null,"(j - 5)(j + 11) =","j² + 6j - 55",null,"(j - 5)² =","j² - 10j + 25",null,"(j - 5)(j + 5) =","j² - 25",null,"(j - 5)(j + 5) =","j² - 25"]
[43,107,"k",101,101,"e",1,0,"","",1,0,"","",5,5,5,5,5,5,5,1," - ","5",4,0,"","4",8,8,8,8,8,8,8,1,1," - ","8",null,1,"",25,"25",-13,"13"," - ",40,"40"," + "," + ",null,null,0,null,"(k - 5)(k - 8) =","k² - 13k + 40",null,"(k - 5)² =","k² - 10k + 25",null,"(k - 5)(k + 5) =","k² - 25",null,"(k - 5)(k - 8) =","k² - 13k + 40"]
[44,110,"n",103,103,"g",1,0,"","",1,0,"","",7,7,7,7,7,7,7,1," - ","7",7,0,"","7",9,9,9,9,9,9,9,1,1," - ","9",null,1,"",49,"49",-16,"16"," - ",63,"63"," + "," + ",null,null,3,null,"(n - 7)(n - 9) =","n² - 16n + 63",null,"(n - 7)² =","n² - 14n + 49",null,"(n - 7)(n + 7) =","n² - 49",null,"(n - 7)² =","n² - 14n + 49"]
[45,120,"x",107,107,"k",1,0,"","",1,0,"","",6,6,6,6,6,6,6,1," - ","6",5,0,"","5",9,9,9,9,9,9,9,0,0," + ","9",null,1,"",36,"36",3,"3"," + ",-54,"54"," - "," + ",null,null,6,null,"(x - 6)(x + 9) =","x² + 3x - 54",null,"(x - 6)² =","x² - 12x + 36",null,"(x - 6)(x + 6) =","x² - 36",null,"(x - 6)(x + 6) =","x² - 36"]
[46,107,"k",105,105,"i",1,0,"","",1,0,"","",7,7,7,7,7,7,7,1," - ","7",5,0,"","5",10,10,10,10,10,10,10,1,1," - ","10",null,1,"",49,"49",-17,"17"," - ",70,"70"," + "," + ",null,null,6,null,"(k - 7)(k - 10) =","k² - 17k + 70",null,"(k - 7)² =","k² - 14k + 49",null,"(k - 7)(k + 7) =","k² - 49",null,"(k - 7)(k + 7) =","k² - 49"]
[47,116,"t",99,99,"c",1,0,"","",1,0,"","",3,3,3,3,3,3,3,1," - ","3",5,0,"","5",5,5,5,5,5,5,5,0,0," + ","5",null,1,"",9,"9",2,"2"," + ",-15,"15"," - "," + ",null,null,0,null,"(t - 3)(t + 5) =","t² + 2t - 15",null,"(t - 3)² =","t² - 6t + 9",null,"(t - 3)(t + 3) =","t² - 9",null,"(t - 3)(t + 5) =","t² + 2t - 15"]
[48,112,"p",107,107,"k",1,0,"","",1,0,"","",4,4,4,4,4,4,4,0," + ","4",2,0,"","2",1,1,1,1,1,1,1,0,0," + ","1",null,1,"",16,"16",5,"5"," + ",4,"4"," + "," - ",null,null,0,null,"(p + 4)(p + 1) =","p² + 5p + 4",null,"(p + 4)² =","p² + 8p + 16",null,"(p + 4)(p - 4) =","p² - 16",null,"(p + 4)(p + 1) =","p² + 5p + 4"]
[49,99,"c",104,104,"h",1,0,"","",1,0,"","",2,2,2,2,2,2,2,1," - ","2",7,0,"","7",9,9,9,9,9,9,9,1,1," - ","9",null,1,"",4,"4",-11,"11"," - ",18,"18"," + "," + ",null,null,3,null,"(c - 2)(c - 9) =","c² - 11c + 18",null,"(c - 2)² =","c² - 4c + 4",null,"(c - 2)(c + 2) =","c² - 4",null,"(c - 2)² =","c² - 4c + 4"]
[50,104,"h",116,116,"t",1,0,"","",1,0,"","",3,3,3,3,3,3,3,0," + ","3",8,0,"","8",11,11,11,11,11,11,11,0,0," + ","11",null,1,"",9,"9",14,"14"," + ",33,"33"," + "," - ",null,null,0,null,"(h + 3)(h + 11) =","h² + 14h + 33",null,"(h + 3)² =","h² + 6h + 9",null,"(h + 3)(h - 3) =","h² - 9",null,"(h + 3)(h + 11) =","h² + 14h + 33"]
[51,114,"r",105,105,"i",1,0,"","",1,0,"","",7,7,7,7,7,7,7,1," - ",{"$f":"IF(U53=1,\"\",TEXT(U53,0))","v":"7"},{"$f":"INT(9*RAND()+1)","v":2},0,"","2",2,2,2,2,2,2,2,1,1," - ",{"$f":"IF(AI53=1,\"\",TEXT(AI53,0))","v":"2"},null,1,"",49,"49",-9,"9"," - ",14,{"$f":"IF(AV53=1,\"\",TEXT(ABS(AV53),0))","v":"14"}," + "," + ",null,null,0,null,{"$f":"CONCATENATE(\"(\",$N53,$C53,$W53,$X53,$F53,\")\",\"(\",$J53,$C53,$AL53,$AM53,$F53,\")\",\" =\")","v":"(r - 7i)(r - 2i) ="},{"$f":"CONCATENATE($C53,CHAR(178),$AU53,$AT53,$C53,$F53,$AX53,$AW53,$F53,CHAR(178))","v":"r² - 9ri + 14i²"},null,{"$f":"CONCATENATE(\"(\",$N53,$C53,$W53,$X53,$F53,\")\",CHAR(178),\" =\")","v":"(r - 7i)² ="},{"$f":"CONCATENATE($AP53,$C53,CHAR(178),$W53,2*$U53*$K53,$C53,$F53,\" + \",$AR53,$F53,CHAR(178))","v":"r² - 14ri + 49i²"},null,{"$f":"CONCATENATE(\"(\",$N53,$C53,$W53,$X53,$F53,\")\",\"(\",$N53,$C53,$AY53,$X53,$F53,\")\",\" =\")","v":"(r - 7i)(r + 7i) ="},{"$f":"CONCATENATE($AP53,$C53,CHAR(178),\" - \",($AR53),$F53,CHAR(178))","v":"r² - 49i²"},null,"(r - 7i)(r - 2i) =","r² - 9ri + 14i²"]
[52,99,"c",106,106,"j",1,0,"","",1,0,"","",4,4,4,4,4,4,4,1," - ",{"$f":"IF(U54=1,\"\",TEXT(U54,0))","v":"4"},1,0,"","",2,2,2,2,2,2,2,0,0," + ",{"$f":"IF(AI54=1,\"\",TEXT(AI54,0))","v":"2"},null,1,"",16,"16",-2,"2"," - ",-8,"8"," - "," + ",null,null,3,null,{"$f":"CONCATENATE(\"(\",$N54,$C54,$W54,$X54,$F54,\")\",\"(\",$J54,$C54,$AL54,$AM54,$F54,\")\",\" =\")","v":"(c - 4j)(c + 2j) ="},{"$f":"CONCATENATE($C54,CHAR(178),$AU54,$AT54,$C54,$F54,$AX54,$AW54,$F54,CHAR(178))","v":"c² - 2cj - 8j²"},null,{"$f":"CONCATENATE(\"(\",$N54,$C54,$W54,$X54,$F54,\")\",CHAR(178),\" =\")","v":"(c - 4j)² ="},{"$f":"CONCATENATE($AP54,$C54,CHAR(178),$W54,2*$U54*$K54,$C54,$F54,\" + \",$AR54,$F54,CHAR(178))","v":"c² - 8cj + 16j²"},null,{"$f":"CONCATENATE(\"(\",$N54,$C54,$W54,$X54,$F54,\")\",\"(\",$N54,$C54,$AY54,$X54,$F54,\")\",\" =\")","v":"(c - 4j)(c + 4j) ="},{"$f":"CONCATENATE($AP54,$C54,CHAR(178),\" - \",($AR54),$F54,CHAR(178))","v":"c² - 16j²"},null,"(c - 4j)² =","c² - 8cj + 16j²"]
[53,115,"s",98,98,"b",1,0,"","",1,0,"","",2,2,2,2,2,2,2,1," - ","2",4,0,"","4",1,1,1,1,1,1,1,1,1," - ","",null,1,"",4,"4",-3,"3"," - ",2,"2"," + "," + ",null,null,6,null,"(s - 2b)(s - b) =","s² - 3sb + 2b²",null,"(s - 2b)² =","s² - 4sb + 4b²",null,"(s - 2b)(s + 2b) =","s² - 4b²",null,"(s - 2b)(s + 2b) =","s² - 4b²"]
[54,120,"x",103,103,"g",1,0,"","",1,0,"","",6,6,6,6,6,6,6,0," + ","6",7,0,"","7",12,12,12,12,12,12,12,0,0," + ","12",null,1,"",36,"36",18,"18"," + ",72,"72"," + "," - ",null,null,6,null,"(x + 6g)(x + 12g) =","x² + 18xg + 72g²",null,"(x + 6g)² =","x² + 12xg + 36g²",null,"(x + 6g)(x - 6g) =","x² - 36g²",null,"(x + 6g)(x - 6g) =","x² - 36g²"]
[55,104,"h",105,105,"i",1,0,"","",1,0,"","",1,1,1,1,1,1,1,0," + ","",6,0,"","6",11,11,11,11,11,11,11,0,0," + ","11",null,1,"",1,"",12,"12"," + ",11,"11"," + "," - ",null,null,3,null,"(h + i)(h + 11i) =","h² + 12hi + 11i²",null,"(h + i)² =","h² + 2hi + i²",null,"(h + i)(h - i) =","h² - i²",null,"(h + i)² =","h² + 2hi + i²"]
[56,108,"m",108,109,"m",1,0,"","",1,0,"","",6,6,6,6,6,6,6,1," - ","6",2,0,"","2",6,6,6,6,6,6,6,0,1," - ","6",null,1,"",36,"36",-12,"12"," - ",36,"36"," + "," + ",null,null,3,null,"(m - 6m)(m - 6m) =","m² - 12mm + 36m²",null,"(m - 6m)² =","m² - 12mm + 36m²",null,"(m - 6m)(m + 6m) =","m² - 36m²",null,"(m - 6m)² =","m² - 12mm + 36m²"]
[57,108,"m",119,119,"w",1,0,"","",1,0,"","",6,6,6,6,6,6,6,1," - ","6",6,0,"","6",6,6,6,6,6,6,6,1,1," - ","6",null,1,"",36,"36",-12,"12"," - ",36,"36"," + "," + ",null,null,0,null,"(m - 6w)(m - 6w) =","m² - 12mw + 36w²",null,"(m - 6w)² =","m² - 12mw + 36w²",null,"(m - 6w)(m + 6w) =","m² - 36w²",null,"(m - 6w)(m - 6w) =","m² - 12mw + 36w²"]
[58,103,"g",116,116,"t",1,0,"","",1,0,"","",3,3,3,3,3,3,3,1," - ","3",5,0,"","5",5,5,5,5,5,5,5,1,1," - ","5",null,1,"",9,"9",-8,"8"," - ",15,"15"," + "," + ",null,null,6,null,"(g - 3t)(g - 5t) =","g² - 8gt + 15t²",null,"(g - 3t)² =","g² - 6gt + 9t²",null,"(g - 3t)(g + 3t) =","g² - 9t²",null,"(g - 3t)(g + 3t) =","g² - 9t²"]
[59,117,"u",118,118,"v",1,0,"","",1,0,"","",4,4,4,4,4,4,4,1," - ","4",9,0,"","9",12,12,12,12,12,12,12,1,1," - ","12",null,1,"",16,"16",-16,"16"," - ",48,"48"," + "," + ",null,null,6,null,"(u - 4v)(u - 12v) =","u² - 16uv + 48v²",null,"(u - 4v)² =","u² - 8uv + 16v²",null,"(u - 4v)(u + 4v) =","u² - 16v²",null,"(u - 4v)(u + 4v) =","u² - 16v²"]
[60,109,"m",105,105,"i",1,0,"","",1,0,"","",2,2,2,2,2,2,2,0," + ","2",6,0,"","6",4,4,4,4,4,4,4,0,0," + ","4",null,1,"",4,"4",6,"6"," + ",8,"8"," + "," - ",null,null,3,null,"(m + 2i)(m + 4i) =","m² + 6mi + 8i²",null,"(m + 2i)² =","m² + 4mi + 4i²",null,"(m + 2i)(m - 2i) =","m² - 4i²",null,"(m + 2i)² =","m² + 4mi + 4i²"]
[61,113,"q",107,107,"k",1,0,"","",1,0,"","",1,1,1,1,1,1,1,1," - ","",4,0,"","4",5,5,5,5,5,5,5,0,0," + ","5",null,1,"",1,"",4,"4"," + ",-5,"5"," - "," + ",null,null,0,null,"(q - k)(q + 5k) =","q² + 4qk - 5k²",null,"(q - k)² =","q² - 2qk + k²",null,"(q - k)(q + k) =","q² - k²",null,"(q - k)(q + 5k) =","q² + 4qk - 5k²"]
[62,119,"w",106,106,"j",1,0,"","",1,0,"","",7,7,7,7,7,7,7,1," - ","7",8,0,"","8",8,8,8,8,8,8,8,1,1," - ","8",null,1,"",49,"49",-15,"15"," - ",56,"56"," + "," + ",null,null,6,null,"(w - 7j)(w - 8j) =","w² - 15wj + 56j²",null,"(w - 7j)² =","w² - 14wj + 49j²",null,"(w - 7j)(w + 7j) =","w² - 49j²",null,"(w - 7j)(w + 7j) =","w² - 49j²"]
[63,109,"m",119,119,"w",1,0,"","",1,0,"","",2,2,2,2,2,2,2,1," - ","2",1,0,"","",2,2,2,2,2,2,2,1,1," - ","2",null,1,"",4,"4",-4,"4"," - ",4,"4"," + "," + ",null,null,0,null,"(m - 2w)(m - 2w) =","m² - 4mw + 4w²",null,"(m - 2w)² =","m² - 4mw + 4w²",null,"(m - 2w)(m + 2w) =","m² - 4w²",null,"(m - 2w)(m - 2w) =","m² - 4mw + 4w²"]
[64,118,"v",113,113,"q",1,0,"","",1,0,"","",3,3,3,3,3,3,3,0," + ","3",7,0,"","7",11,11,11,11,11,11,11,0,0," + ","11",null,1,"",9,"9",14,"14"," + ",33,"33"," + "," - ",null,null,0,null,"(v + 3q)(v + 11q) =","v² + 14vq + 33q²",null,"(v + 3q)² =","v² + 6vq + 9q²",null,"(v + 3q)(v - 3q) =","v² - 9q²",null,"(v + 3q)(v + 11q) =","v² + 14vq + 33q²"]
[65,100,"d",104,104,"h",1,0,{"$f":"IF(H67=0,\"\",\"-\")","v":""},"",1,0,"","",1,1,1,1,1,1,1,{"$f":"INT(2*RAND())","v":1}," - ","",1,0,"","",9,9,9,9,9,9,9,1,1," - ","9",null,1,"",1,"",-10,"10"," - ",9,"9"," + "," + ",null,null,{"$f":"3*INT(3*RAND())","v":3},null,"(d - h)(d - 9h) =","d² - 10dh + 9h²",null,"(d - h)² =","d² - 2dh + h²",null,"(d - h)(d + h) =","d² - h²",null,{"$f":"OFFSET(BD67,0,VALUE(BB67))","v":"(d - h)² ="},{"$f":"OFFSET(BE67,0,VALUE(BB67))","v":"d² - 2dh + h²"}]
[66,{"$f":"INT(24*RAND()+97)","v":109},{"$f":"IF(B68=108,CHAR(B68+1),CHAR(B68))","v":"m"},{"$f":"INT(24*RAND()+97)","v":116},{"$f":"IF(D68=B68, D68+1,IF(D68=C68,D68+1,D68))","v":116},{"$f":"IF(E68=108,CHAR(E68+1),CHAR(E68))","v":"t"},1,0,"",{"$f":"IF(G68=1,\"\",TEXT(G68,G68))","v":""},1,0,{"$f":"IF(L68=0,\"\",\"-\")","v":""},{"$f":"IF(K68=1,\"\",TEXT(K68,K68))","v":""},{"$f":"INT(7*RAND()+1)","v":3},{"$f":"IF(O68=1,1,(IF(AND(INT(K68/2)=K68/2,INT(O68/2)=O68/2),O68+1,O68)))","v":3},{"$f":"IF(AND(INT(K68/3)=K68/3,INT(P68/3)=P68/3 ),P68+1,P68)","v":3},{"$f":"IF(AND(INT(K68/4)=K68/4,INT(Q68/4)=Q68/4 ),Q68+1,Q68)","v":3},{"$f":"IF(AND(INT(K68/5)=K68/5,INT(R68/5)=R68/5 ),R68+1,R68)","v":3},3,3,0,{"$f":"IF(V68=0,\" + \",\" - \")","v":" + "},"3",7,0,{"$f":"IF(Z68=0,\"\",\"-\")","v":""},{"$f":"IF(Y68=1,\"\",TEXT(Y68,Y68))","v":"7"},{"$f":"INT(12*RAND()+1)","v":12},{"$f":"IF(AC68=1,1,(IF(AND(INT(G68/2)=G68/2,INT(AC68/2)=AC68/2),AC68+1,AC68)))","v":12},{"$f":"IF(AND(INT(G68/3)=G68/3,INT(AD68/3)=AD68/3 ),AD68+1,AD68)","v":12},{"$f":"IF(AND(INT(G68/4)=G68/4,INT(AE68/4)=AE68/4 ),AE68+1,AE68)","v":12},{"$f":"IF(AND(INT(G68/5)=G68/5,INT($AF68/5)=$AF68/5 ),$AF68+1,$AF68)","v":12},12,{"$f":"IF(AND(INT(G68/2)=G68/2,INT(AH68/2)=AH68/2 ),AH68+1,AH68)","v":12},0,0,{"$f":"IF(AK68=0,\" + \",\" - \")","v":" + "},"12",null,{"$f":"K68^2","v":1},{"$f":"IF(AO68=1,\"\",TEXT(AO68,0))","v":""},{"$f":"U68^2","v":9},{"$f":"IF(AQ68=1,\"\",TEXT(AQ68,0))","v":"9"},{"$f":"(-1)^(L68+1)*K68*(-1)^(AK68+1)*AI68+(-1)^(V68+1)*U68*(-1)^(H68+1)*G68","v":15},{"$f":"IF(ABS(AS68)=1,\"\",TEXT(ABS(AS68),0))","v":"15"},{"$f":"IF(AS68<1,\" - \",\" + \")","v":" + "},{"$f":"(-1)^(AK68+1)*AI68*(-1)^(V68+1)*U68","v":36},{"$f":"IF(AV68=1,\"\",TEXT(ABS(AV68),0))","v":"36"},{"$f":"IF(AV68<1,\" - \",\" + \")","v":" + "},{"$f":"IF(V68=0,\" - \",\" + \")","v":" - "},null,null,6,null,"(m + 3t)(m + 12t) =","m² + 15mt + 36t²",null,"(m + 3t)² =","m² + 6mt + 9t²",null,"(m + 3t)(m - 3t) =","m² - 9t²",null,"(m + 3t)(m - 3t) =","m² - 9t²"]
[67,99,"c",117,117,"u",1,0,"","",1,0,"","",1,1,1,1,1,{"$f":"IF(AND(INT($K69/7)=$K69/7,INT($S69/7)=$S69/7 ),$S69+1,$S69)","v":1},{"$f":"IF(AND(INT(K69/2)=K69/2,INT(T69/2)=T69/2 ),T69+1,T69)","v":1},1," - ","",1,0,"","",12,12,12,12,12,{"$f":"IF(AND(INT($G69/7)=$G69/7,INT($AG69/7)=$AG69/7 ),$AG69+1,$AG69)","v":12},12,0,0," + ","12",null,1,"",1,"",11,"11"," + ",-12,"12"," - "," + ",null,null,3,null,"(c - u)(c + 12u) =","c² + 11cu - 12u²",null,"(c - u)² =","c² - 2cu + u²",null,"(c - u)(c + u) =","c² - u²",null,"(c - u)² =","c² - 2cu + u²"]
[68,112,"p",116,116,"t",1,0,"","",1,0,"","",1,1,1,1,1,1,1,1," - ","",5,0,"","5",3,3,3,3,3,3,3,0,0," + ","3",null,1,"",1,"",2,"2"," + ",-3,"3"," - "," + ",null,null,3,null,"(p - t)(p + 3t) =","p² + 2pt - 3t²",null,"(p - t)² =","p² - 2pt + t²",null,"(p - t)(p + t) =","p² - t²",null,"(p - t)² =","p² - 2pt + t²"]
[69,102,"f",101,101,"e",1,0,"","",1,0,"","",5,5,5,5,5,5,5,0," + ","5",4,0,"","4",4,4,4,4,4,4,4,0,0," + ","4",null,1,"",25,"25",9,"9"," + ",20,"20"," + "," - ",null,null,3,null,"(f + 5e)(f + 4e) =","f² + 9fe + 20e²",null,"(f + 5e)² =","f² + 10fe + 25e²",null,"(f + 5e)(f - 5e) =","f² - 25e²",null,"(f + 5e)² =","f² + 10fe + 25e²"]
[70,99,"c",105,105,"i",1,0,"","",1,0,"","",6,6,6,6,6,6,6,0," + ","6",8,0,"","8",4,4,4,4,4,4,4,0,0," + ","4",null,1,"",36,"36",10,"10"," + ",24,"24"," + "," - ",null,null,6,null,"(c + 6i)(c + 4i) =","c² + 10ci + 24i²",null,"(c + 6i)² =","c² + 12ci + 36i²",null,"(c + 6i)(c - 6i) =","c² - 36i²",null,"(c + 6i)(c - 6i) =","c² - 36i²"]
[71,100,"d",112,112,"p",1,0,"","",1,0,"","",4,4,4,4,4,4,4,1," - ","4",1,0,"","",11,11,11,11,11,11,11,1,1," - ","11",null,1,"",16,"16",-15,"15"," - ",44,"44"," + "," + ",null,null,3,null,"(d - 4p)(d - 11p) =","d² - 15dp + 44p²",null,"(d - 4p)² =","d² - 8dp + 16p²",null,"(d - 4p)(d + 4p) =","d² - 16p²",null,"(d - 4p)² =","d² - 8dp + 16p²"]
[72,98,"b",110,110,"n",1,0,"","",1,0,"","",3,3,3,3,3,3,3,0," + ","3",9,0,"","9",5,5,5,5,5,5,5,0,0," + ","5",null,1,"",9,"9",8,"8"," + ",15,"15"," + "," - ",null,null,6,null,"(b + 3n)(b + 5n) =","b² + 8bn + 15n²",null,"(b + 3n)² =","b² + 6bn + 9n²",null,"(b + 3n)(b - 3n) =","b² - 9n²",null,"(b + 3n)(b - 3n) =","b² - 9n²"]
[73,107,"k",105,105,"i",1,0,"","",1,0,"","",2,2,2,2,2,2,2,0," + ","2",1,0,"","",2,2,2,2,2,2,2,1,0," + ","2",null,1,"",4,"4",4,"4"," + ",4,"4"," + "," - ",null,null,3,null,"(k + 2i)(k + 2i) =","k² + 4ki + 4i²",null,"(k + 2i)² =","k² + 4ki + 4i²",null,"(k + 2i)(k - 2i) =","k² - 4i²",null,"(k + 2i)² =","k² + 4ki + 4i²"]
[74,101,"e",113,113,"q",1,0,"","",1,0,"","",7,7,7,7,7,7,7,1," - ","7",5,0,"","5",5,5,5,5,5,5,5,1,1," - ","5",null,1,"",49,"49",-12,"12"," - ",35,"35"," + "," + ",null,null,0,null,"(e - 7q)(e - 5q) =","e² - 12eq + 35q²",null,"(e - 7q)² =","e² - 14eq + 49q²",null,"(e - 7q)(e + 7q) =","e² - 49q²",null,"(e - 7q)(e - 5q) =","e² - 12eq + 35q²"]
[75,112,"p",102,102,"f",1,0,"","",1,0,"","",4,4,4,4,4,4,4,0," + ","4",3,0,"","3",2,2,2,2,2,2,2,1,1," - ","2",null,1,"",16,"16",2,"2"," + ",-8,"8"," - "," - ",null,null,0,null,"(p + 4f)(p - 2f) =","p² + 2pf - 8f²",null,"(p + 4f)² =","p² + 8pf + 16f²",null,"(p + 4f)(p - 4f) =","p² - 16f²",null,"(p + 4f)(p - 2f) =","p² + 2pf - 8f²"]

{"sheet":"Worksheet","index":2,"n_rows":28,"n_cols":6,"rows_kept":28,"cut":false,"hidden":false,"merged":[]}
[null,null,null,"BINOMIAL EXPANSIONS"]
[null,null,null,null,{"$f":"CONCATENATE(\"Worksheet \",Working!D1,Working!C1)","v":"Worksheet QT-939"}]
["Expand the following;"]
[{"$f":"CONCATENATE(Working!$A3,\")\")","v":"1)"},{"$f":"(Working!$BM3)","v":"(c + 8)² ="},{"$f":"CONCATENATE(Working!$A28,\")\")","v":"26)"},{"$f":"(Working!$BM28)","v":"(r - 2)² ="},{"$f":"CONCATENATE(Working!$A53,\")\")","v":"51)"},{"$f":"(Working!$BM53)","v":"(r - 7i)(r - 2i) ="}]
[{"$f":"CONCATENATE(Working!$A4,\")\")","v":"2)"},{"$f":"(Working!$BM4)","v":"(o + 5)² ="},{"$f":"CONCATENATE(Working!$A29,\")\")","v":"27)"},{"$f":"(Working!$BM29)","v":"(u + 5)(u - 5) ="},{"$f":"CONCATENATE(Working!$A54,\")\")","v":"52)"},{"$f":"(Working!$BM54)","v":"(c - 4j)² ="}]
[{"$f":"CONCATENATE(Working!$A5,\")\")","v":"3)"},{"$f":"(Working!$BM5)","v":"(b + 2)(b - 2) ="},{"$f":"CONCATENATE(Working!$A30,\")\")","v":"28)"},{"$f":"(Working!$BM30)","v":"(a + 5)(a - 2) ="},{"$f":"CONCATENATE(Working!$A55,\")\")","v":"53)"},{"$f":"(Working!$BM55)","v":"(s - 2b)(s + 2b) ="}]
[{"$f":"CONCATENATE(Working!$A6,\")\")","v":"4)"},{"$f":"(Working!$BM6)","v":"(m + 5)² ="},{"$f":"CONCATENATE(Working!$A31,\")\")","v":"29)"},{"$f":"(Working!$BM31)","v":"(d - 7)(d + 7) ="},{"$f":"CONCATENATE(Working!$A56,\")\")","v":"54)"},{"$f":"(Working!$BM56)","v":"(x + 6g)(x - 6g) ="}]
[{"$f":"CONCATENATE(Working!$A7,\")\")","v":"5)"},{"$f":"(Working!$BM7)","v":"(i + 3)² ="},{"$f":"CONCATENATE(Working!$A32,\")\")","v":"30)"},{"$f":"(Working!$BM32)","v":"(g - 1)(g + 4) ="},{"$f":"CONCATENATE(Working!$A57,\")\")","v":"55)"},{"$f":"(Working!$BM57)","v":"(h + i)² ="}]
[{"$f":"CONCATENATE(Working!$A8,\")\")","v":"6)"},{"$f":"(Working!$BM8)","v":"(t + 7)(t - 7) ="},{"$f":"CONCATENATE(Working!$A33,\")\")","v":"31)"},{"$f":"(Working!$BM33)","v":"(d + 6)² ="},{"$f":"CONCATENATE(Working!$A58,\")\")","v":"56)"},{"$f":"(Working!$BM58)","v":"(m - 6m)² ="}]
[{"$f":"CONCATENATE(Working!$A9,\")\")","v":"7)"},{"$f":"(Working!$BM9)","v":"(o + 11)² ="},{"$f":"CONCATENATE(Working!$A34,\")\")","v":"32)"},{"$f":"(Working!$BM34)","v":"(u + 6)(u - 6) ="},{"$f":"CONCATENATE(Working!$A59,\")\")","v":"57)"},{"$f":"(Working!$BM59)","v":"(m - 6w)(m - 6w) ="}]
[{"$f":"CONCATENATE(Working!$A10,\")\")","v":"8)"},{"$f":"(Working!$BM10)","v":"(x + 8)(x - 8) ="},{"$f":"CONCATENATE(Working!$A35,\")\")","v":"33)"},{"$f":"(Working!$BM35)","v":"(k + 3)(k - 3) ="},{"$f":"CONCATENATE(Working!$A60,\")\")","v":"58)"},{"$f":"(Working!$BM60)","v":"(g - 3t)(g + 3t) ="}]
[{"$f":"CONCATENATE(Working!$A11,\")\")","v":"9)"},{"$f":"(Working!$BM11)","v":"(s + 6)² ="},{"$f":"CONCATENATE(Working!$A36,\")\")","v":"34)"},{"$f":"(Working!$BM36)","v":"(n + 7)(n - 3) ="},{"$f":"CONCATENATE(Working!$A61,\")\")","v":"59)"},{"$f":"(Working!$BM61)","v":"(u - 4v)(u + 4v) ="}]
[{"$f":"CONCATENATE(Working!$A12,\")\")","v":"10)"},{"$f":"(Working!$BM12)","v":"(m + 1)(m - 1) ="},{"$f":"CONCATENATE(Working!$A37,\")\")","v":"35)"},{"$f":"(Working!$BM37)","v":"(k + 3)² ="},{"$f":"CONCATENATE(Working!$A62,\")\")","v":"60)"},{"$f":"(Working!$BM62)","v":"(m + 2i)² ="}]
[{"$f":"CONCATENATE(Working!$A13,\")\")","v":"11)"},{"$f":"(Working!$BM13)","v":"(m - 12)² ="},{"$f":"CONCATENATE(Working!$A38,\")\")","v":"36)"},{"$f":"(Working!$BM38)","v":"(m - 5)(m + 5) ="},{"$f":"CONCATENATE(Working!$A63,\")\")","v":"61)"},{"$f":"(Working!$BM63)","v":"(q - k)(q + 5k) ="}]
[{"$f":"CONCATENATE(Working!$A14,\")\")","v":"12)"},{"$f":"(Working!$BM14)","v":"(m - 5)(m - 3) ="},{"$f":"CONCATENATE(Working!$A39,\")\")","v":"37)"},{"$f":"(Working!$BM39)","v":"(q - 2)² ="},{"$f":"CONCATENATE(Working!$A64,\")\")","v":"62)"},{"$f":"(Working!$BM64)","v":"(w - 7j)(w + 7j) ="}]
[{"$f":"CONCATENATE(Working!$A15,\")\")","v":"13)"},{"$f":"(Working!$BM15)","v":"(e - 6)² ="},{"$f":"CONCATENATE(Working!$A40,\")\")","v":"38)"},{"$f":"(Working!$BM40)","v":"(t - 7)(t + 7) ="},{"$f":"CONCATENATE(Working!$A65,\")\")","v":"63)"},{"$f":"(Working!$BM65)","v":"(m - 2w)(m - 2w) ="}]
[{"$f":"CONCATENATE(Working!$A16,\")\")","v":"14)"},{"$f":"(Working!$BM16)","v":"(d - 8)² ="},{"$f":"CONCATENATE(Working!$A41,\")\")","v":"39)"},{"$f":"(Working!$BM41)","v":"(s + 4)² ="},{"$f":"CONCATENATE(Working!$A66,\")\")","v":"64)"},{"$f":"(Working!$BM66)","v":"(v + 3q)(v + 11q) ="}]
[{"$f":"CONCATENATE(Working!$A17,\")\")","v":"15)"},{"$f":"(Working!$BM17)","v":"(j - 11)(j - 3) ="},{"$f":"CONCATENATE(Working!$A42,\")\")","v":"40)"},{"$f":"(Working!$BM42)","v":"(q - 1)(q + 9) ="},{"$f":"CONCATENATE(Working!$A67,\")\")","v":"65)"},{"$f":"(Working!$BM67)","v":"(d - h)² ="}]
[{"$f":"CONCATENATE(Working!$A18,\")\")","v":"16)"},{"$f":"(Working!$BM18)","v":"(x - 6)(x - 5) ="},{"$f":"CONCATENATE(Working!$A43,\")\")","v":"41)"},{"$f":"(Working!$BM43)","v":"(m - 3)² ="},{"$f":"CONCATENATE(Working!$A68,\")\")","v":"66)"},{"$f":"(Working!$BM68)","v":"(m + 3t)(m - 3t) ="}]
[{"$f":"CONCATENATE(Working!$A19,\")\")","v":"17)"},{"$f":"(Working!$BM19)","v":"(d - 2)² ="},{"$f":"CONCATENATE(Working!$A44,\")\")","v":"42)"},{"$f":"(Working!$BM44)","v":"(j - 5)(j + 5) ="},{"$f":"CONCATENATE(Working!$A69,\")\")","v":"67)"},{"$f":"(Working!$BM69)","v":"(c - u)² ="}]
[{"$f":"CONCATENATE(Working!$A20,\")\")","v":"18)"},{"$f":"(Working!$BM20)","v":"(e - 1)(e + 1) ="},{"$f":"CONCATENATE(Working!$A45,\")\")","v":"43)"},{"$f":"(Working!$BM45)","v":"(k - 5)(k - 8) ="},{"$f":"CONCATENATE(Working!$A70,\")\")","v":"68)"},{"$f":"(Working!$BM70)","v":"(p - t)² ="}]
[{"$f":"CONCATENATE(Working!$A21,\")\")","v":"19)"},{"$f":"(Working!$BM21)","v":"(n - 11)(n + 11) ="},{"$f":"CONCATENATE(Working!$A46,\")\")","v":"44)"},{"$f":"(Working!$BM46)","v":"(n - 7)² ="},{"$f":"CONCATENATE(Working!$A71,\")\")","v":"69)"},{"$f":"(Working!$BM71)","v":"(f + 5e)² ="}]
[{"$f":"CONCATENATE(Working!$A22,\")\")","v":"20)"},{"$f":"(Working!$BM22)","v":"(c - 11)² ="},{"$f":"CONCATENATE(Working!$A47,\")\")","v":"45)"},{"$f":"(Working!$BM47)","v":"(x - 6)(x + 6) ="},{"$f":"CONCATENATE(Working!$A72,\")\")","v":"70)"},{"$f":"(Working!$BM72)","v":"(c + 6i)(c - 6i) ="}]
[{"$f":"CONCATENATE(Working!$A23,\")\")","v":"21)"},{"$f":"(Working!$BM23)","v":"(h + 2)(h + 10) ="},{"$f":"CONCATENATE(Working!$A48,\")\")","v":"46)"},{"$f":"(Working!$BM48)","v":"(k - 7)(k + 7) ="},{"$f":"CONCATENATE(Working!$A73,\")\")","v":"71)"},{"$f":"(Working!$BM73)","v":"(d - 4p)² ="}]
[{"$f":"CONCATENATE(Working!$A24,\")\")","v":"22)"},{"$f":"(Working!$BM24)","v":"(p + 1)(p - 1) ="},{"$f":"CONCATENATE(Working!$A49,\")\")","v":"47)"},{"$f":"(Working!$BM49)","v":"(t - 3)(t + 5) ="},{"$f":"CONCATENATE(Working!$A74,\")\")","v":"72)"},{"$f":"(Working!$BM74)","v":"(b + 3n)(b - 3n) ="}]
[{"$f":"CONCATENATE(Working!$A25,\")\")","v":"23)"},{"$f":"(Working!$BM25)","v":"(a + 3)(a + 10) ="},{"$f":"CONCATENATE(Working!$A50,\")\")","v":"48)"},{"$f":"(Working!$BM50)","v":"(p + 4)(p + 1) ="},{"$f":"CONCATENATE(Working!$A75,\")\")","v":"73)"},{"$f":"(Working!$BM75)","v":"(k + 2i)² ="}]
[{"$f":"CONCATENATE(Working!$A26,\")\")","v":"24)"},{"$f":"(Working!$BM26)","v":"(w - 5)² ="},{"$f":"CONCATENATE(Working!$A51,\")\")","v":"49)"},{"$f":"(Working!$BM51)","v":"(c - 2)² ="},{"$f":"CONCATENATE(Working!$A76,\")\")","v":"74)"},{"$f":"(Working!$BM76)","v":"(e - 7q)(e - 5q) ="}]
[{"$f":"CONCATENATE(Working!$A27,\")\")","v":"25)"},{"$f":"(Working!$BM27)","v":"(p + 1)(p + 8) ="},{"$f":"CONCATENATE(Working!$A52,\")\")","v":"50)"},{"$f":"(Working!$BM52)","v":"(h + 3)(h + 11) ="},{"$f":"CONCATENATE(Working!$A77,\")\")","v":"75)"},{"$f":"(Working!$BM77)","v":"(p + 4f)(p - 2f) ="}]

{"sheet":"Answers","index":3,"n_rows":28,"n_cols":7,"rows_kept":28,"cut":false,"hidden":false,"merged":[]}
[null,null,null,"BINOMIAL EXPANSIONS"]
[null,null,null,"Answers",null,null,{"$f":"CONCATENATE(\"Worksheet \",Working!D1,Working!C1)","v":"Worksheet QT-939"}]
[]
[{"$f":"CONCATENATE(Working!$A3,\")\")","v":"1)"},{"$f":"Working!$BN3","v":"c² + 16c + 64"},{"$f":"CONCATENATE(Working!$A28,\")\")","v":"26)"},{"$f":"Working!$BN28","v":"r² - 4r + 4"},{"$f":"CONCATENATE(Working!$A53,\")\")","v":"51)"},{"$f":"Working!$BN53","v":"r² - 9ri + 14i²"}]
[{"$f":"CONCATENATE(Working!$A4,\")\")","v":"2)"},{"$f":"Working!$BN4","v":"o² + 10o + 25"},{"$f":"CONCATENATE(Working!$A29,\")\")","v":"27)"},{"$f":"Working!$BN29","v":"u² - 25"},{"$f":"CONCATENATE(Working!$A54,\")\")","v":"52)"},{"$f":"Working!$BN54","v":"c² - 8cj + 16j²"}]
[{"$f":"CONCATENATE(Working!$A5,\")\")","v":"3)"},{"$f":"Working!$BN5","v":"b² - 4"},{"$f":"CONCATENATE(Working!$A30,\")\")","v":"28)"},{"$f":"Working!$BN30","v":"a² + 3a - 10"},{"$f":"CONCATENATE(Working!$A55,\")\")","v":"53)"},{"$f":"Working!$BN55","v":"s² - 4b²"}]
[{"$f":"CONCATENATE(Working!$A6,\")\")","v":"4)"},{"$f":"Working!$BN6","v":"m² + 10m + 25"},{"$f":"CONCATENATE(Working!$A31,\")\")","v":"29)"},{"$f":"Working!$BN31","v":"d² - 49"},{"$f":"CONCATENATE(Working!$A56,\")\")","v":"54)"},{"$f":"Working!$BN56","v":"x² - 36g²"}]
[{"$f":"CONCATENATE(Working!$A7,\")\")","v":"5)"},{"$f":"Working!$BN7","v":"i² + 6i + 9"},{"$f":"CONCATENATE(Working!$A32,\")\")","v":"30)"},{"$f":"Working!$BN32","v":"g² + 3g - 4"},{"$f":"CONCATENATE(Working!$A57,\")\")","v":"55)"},{"$f":"Working!$BN57","v":"h² + 2hi + i²"}]
[{"$f":"CONCATENATE(Working!$A8,\")\")","v":"6)"},{"$f":"Working!$BN8","v":"t² - 49"},{"$f":"CONCATENATE(Working!$A33,\")\")","v":"31)"},{"$f":"Working!$BN33","v":"d² + 12d + 36"},{"$f":"CONCATENATE(Working!$A58,\")\")","v":"56)"},{"$f":"Working!$BN58","v":"m² - 12mm + 36m²"}]
[{"$f":"CONCATENATE(Working!$A9,\")\")","v":"7)"},{"$f":"Working!$BN9","v":"o² + 22o + 121"},{"$f":"CONCATENATE(Working!$A34,\")\")","v":"32)"},{"$f":"Working!$BN34","v":"u² - 36"},{"$f":"CONCATENATE(Working!$A59,\")\")","v":"57)"},{"$f":"Working!$BN59","v":"m² - 12mw + 36w²"}]
[{"$f":"CONCATENATE(Working!$A10,\")\")","v":"8)"},{"$f":"Working!$BN10","v":"x² - 64"},{"$f":"CONCATENATE(Working!$A35,\")\")","v":"33)"},{"$f":"Working!$BN35","v":"k² - 9"},{"$f":"CONCATENATE(Working!$A60,\")\")","v":"58)"},{"$f":"Working!$BN60","v":"g² - 9t²"}]
[{"$f":"CONCATENATE(Working!$A11,\")\")","v":"9)"},{"$f":"Working!$BN11","v":"s² + 12s + 36"},{"$f":"CONCATENATE(Working!$A36,\")\")","v":"34)"},{"$f":"Working!$BN36","v":"n² + 4n - 21"},{"$f":"CONCATENATE(Working!$A61,\")\")","v":"59)"},{"$f":"Working!$BN61","v":"u² - 16v²"}]
[{"$f":"CONCATENATE(Working!$A12,\")\")","v":"10)"},{"$f":"Working!$BN12","v":"m² - 1"},{"$f":"CONCATENATE(Working!$A37,\")\")","v":"35)"},{"$f":"Working!$BN37","v":"k² + 6k + 9"},{"$f":"CONCATENATE(Working!$A62,\")\")","v":"60)"},{"$f":"Working!$BN62","v":"m² + 4mi + 4i²"}]
[{"$f":"CONCATENATE(Working!$A13,\")\")","v":"11)"},{"$f":"Working!$BN13","v":"m² - 24m + 144"},{"$f":"CONCATENATE(Working!$A38,\")\")","v":"36)"},{"$f":"Working!$BN38","v":"m² - 25"},{"$f":"CONCATENATE(Working!$A63,\")\")","v":"61)"},{"$f":"Working!$BN63","v":"q² + 4qk - 5k²"}]
[{"$f":"CONCATENATE(Working!$A14,\")\")","v":"12)"},{"$f":"Working!$BN14","v":"m² - 8m + 15"},{"$f":"CONCATENATE(Working!$A39,\")\")","v":"37)"},{"$f":"Working!$BN39","v":"q² - 4q + 4"},{"$f":"CONCATENATE(Working!$A64,\")\")","v":"62)"},{"$f":"Working!$BN64","v":"w² - 49j²"}]
[{"$f":"CONCATENATE(Working!$A15,\")\")","v":"13)"},{"$f":"Working!$BN15","v":"e² - 12e + 36"},{"$f":"CONCATENATE(Working!$A40,\")\")","v":"38)"},{"$f":"Working!$BN40","v":"t² - 49"},{"$f":"CONCATENATE(Working!$A65,\")\")","v":"63)"},{"$f":"Working!$BN65","v":"m² - 4mw + 4w²"}]
[{"$f":"CONCATENATE(Working!$A16,\")\")","v":"14)"},{"$f":"Working!$BN16","v":"d² - 16d + 64"},{"$f":"CONCATENATE(Working!$A41,\")\")","v":"39)"},{"$f":"Working!$BN41","v":"s² + 8s + 16"},{"$f":"CONCATENATE(Working!$A66,\")\")","v":"64)"},{"$f":"Working!$BN66","v":"v² + 14vq + 33q²"}]
[{"$f":"CONCATENATE(Working!$A17,\")\")","v":"15)"},{"$f":"Working!$BN17","v":"j² - 14j + 33"},{"$f":"CONCATENATE(Working!$A42,\")\")","v":"40)"},{"$f":"Working!$BN42","v":"q² + 8q - 9"},{"$f":"CONCATENATE(Working!$A67,\")\")","v":"65)"},{"$f":"Working!$BN67","v":"d² - 2dh + h²"}]
[{"$f":"CONCATENATE(Working!$A18,\")\")","v":"16)"},{"$f":"Working!$BN18","v":"x² - 11x + 30"},{"$f":"CONCATENATE(Working!$A43,\")\")","v":"41)"},{"$f":"Working!$BN43","v":"m² - 6m + 9"},{"$f":"CONCATENATE(Working!$A68,\")\")","v":"66)"},{"$f":"Working!$BN68","v":"m² - 9t²"}]
[{"$f":"CONCATENATE(Working!$A19,\")\")","v":"17)"},{"$f":"Working!$BN19","v":"d² - 4d + 4"},{"$f":"CONCATENATE(Working!$A44,\")\")","v":"42)"},{"$f":"Working!$BN44","v":"j² - 25"},{"$f":"CONCATENATE(Working!$A69,\")\")","v":"67)"},{"$f":"Working!$BN69","v":"c² - 2cu + u²"}]
[{"$f":"CONCATENATE(Working!$A20,\")\")","v":"18)"},{"$f":"Working!$BN20","v":"e² - 1"},{"$f":"CONCATENATE(Working!$A45,\")\")","v":"43)"},{"$f":"Working!$BN45","v":"k² - 13k + 40"},{"$f":"CONCATENATE(Working!$A70,\")\")","v":"68)"},{"$f":"Working!$BN70","v":"p² - 2pt + t²"}]
[{"$f":"CONCATENATE(Working!$A21,\")\")","v":"19)"},{"$f":"Working!$BN21","v":"n² - 121"},{"$f":"CONCATENATE(Working!$A46,\")\")","v":"44)"},{"$f":"Working!$BN46","v":"n² - 14n + 49"},{"$f":"CONCATENATE(Working!$A71,\")\")","v":"69)"},{"$f":"Working!$BN71","v":"f² + 10fe + 25e²"}]
[{"$f":"CONCATENATE(Working!$A22,\")\")","v":"20)"},{"$f":"Working!$BN22","v":"c² - 22c + 121"},{"$f":"CONCATENATE(Working!$A47,\")\")","v":"45)"},{"$f":"Working!$BN47","v":"x² - 36"},{"$f":"CONCATENATE(Working!$A72,\")\")","v":"70)"},{"$f":"Working!$BN72","v":"c² - 36i²"}]
[{"$f":"CONCATENATE(Working!$A23,\")\")","v":"21)"},{"$f":"Working!$BN23","v":"h² + 12h + 20"},{"$f":"CONCATENATE(Working!$A48,\")\")","v":"46)"},{"$f":"Working!$BN48","v":"k² - 49"},{"$f":"CONCATENATE(Working!$A73,\")\")","v":"71)"},{"$f":"Working!$BN73","v":"d² - 8dp + 16p²"}]
[{"$f":"CONCATENATE(Working!$A24,\")\")","v":"22)"},{"$f":"Working!$BN24","v":"p² - 1"},{"$f":"CONCATENATE(Working!$A49,\")\")","v":"47)"},{"$f":"Working!$BN49","v":"t² + 2t - 15"},{"$f":"CONCATENATE(Working!$A74,\")\")","v":"72)"},{"$f":"Working!$BN74","v":"b² - 9n²"}]
[{"$f":"CONCATENATE(Working!$A25,\")\")","v":"23)"},{"$f":"Working!$BN25","v":"a² + 13a + 30"},{"$f":"CONCATENATE(Working!$A50,\")\")","v":"48)"},{"$f":"Working!$BN50","v":"p² + 5p + 4"},{"$f":"CONCATENATE(Working!$A75,\")\")","v":"73)"},{"$f":"Working!$BN75","v":"k² + 4ki + 4i²"}]
[{"$f":"CONCATENATE(Working!$A26,\")\")","v":"24)"},{"$f":"Working!$BN26","v":"w² - 10w + 25"},{"$f":"CONCATENATE(Working!$A51,\")\")","v":"49)"},{"$f":"Working!$BN51","v":"c² - 4c + 4"},{"$f":"CONCATENATE(Working!$A76,\")\")","v":"74)"},{"$f":"Working!$BN76","v":"e² - 12eq + 35q²"}]
[{"$f":"CONCATENATE(Working!$A27,\")\")","v":"25)"},{"$f":"Working!$BN27","v":"p² + 9p + 8"},{"$f":"CONCATENATE(Working!$A52,\")\")","v":"50)"},{"$f":"Working!$BN52","v":"h² + 14h + 33"},{"$f":"CONCATENATE(Working!$A77,\")\")","v":"75)"},{"$f":"Working!$BN77","v":"p² + 2pf - 8f²"}]