{"text_format":"1","workbook":"xlsx","n_sheets":4,"sheets":["Select","Working","Worksheet","Answers"],"not_rendered":{"charts":0,"images":4,"macros":1,"external_links":0,"defined_names":0,"comments":0,"pivot_tables":0},"unopened":[],"bounds":{"document_bytes":16777216,"sheet_cells":100000,"rows_first":2000,"rows_last":500,"rows_between":2000,"halvings":0,"cell_chars":16384,"cell_head_chars":4096},"cells_cut":0,"cells_raw":0,"read":"whole","date_system":"1900"}

{"sheet":"Select","index":0,"n_rows":10,"n_cols":8,"rows_kept":10,"cut":false,"hidden":false,"merged":[[0,0,0,9],[9,2,12,7],[4,7,7,8],[8,2,8,6],[1,2,1,6],[3,2,3,7],[4,2,4,4]]}
["NON-MONIC BINOMIAL EXPANSIONS"]
[null,null,"INSTRUCTIONS"]
[]
[null,"Step 1","Select Desired type of Binomial Expansion"]
[null,null,null,null,null,null,null,"PRESS F9 for NEW WorkSheet"]
[]
[]
[]
[null,"Step 2","Click on tab below to choose WorkSheet."]
[null,"Note","If you click on the WorkSheet tab then hold down shift and click on the Solutions tab, you will be able to print both the WorkSheet and the solutions."]

{"sheet":"Working","index":1,"n_rows":77,"n_cols":66,"rows_kept":77,"cut":false,"hidden":true,"merged":[]}
[null,{"$f":"INT(900*RAND()+100)","v":899},{"$f":"TEXT(1,B1)","v":"899"},"QT-",null,null,"aX(bY+cZ)",null,"(bY+cZ)(AY+dZ)",null,"\"=b^2Y\"^2=2*b*c*YZ+c^2Z^2",null,null,null,null,null,null,null,null,null,null,null,null,{"$f":"IF(U1=1,\"\",TEXT(U1,U1))","v":""},null,null,null,null,null,null,null,null,null,null,null,null,null,null,null,null,null,null,null,null,null,null,null,null,null,null,null,null,null,null,null,"Binomial Expansions - 1",null,null,"Perfect squares - 2",null,null,"Difference of 2 squares - 3"]
[null,null,"Y",null,null,"Z",null,null,null,"a",null,null,null,"b",null,null,null,null,null,null,null,null,null,"c",null,null,null,"d",null,null,null,null,null,null,null,null,null,null,"d",null,"b^2",null,"c^2",null,"bd+ac",null,"Sign","cd",null,"Sign","Sign c2",null,"Questions","Random Question",null,"Expansion","Factorisation"]
[1,{"$f":"INT(24*RAND()+97)","v":109},{"$f":"IF(B3=108,CHAR(B3+1),CHAR(B3))","v":"m"},{"$f":"INT(24*RAND()+97)","v":115},{"$f":"IF(D3=B3, D3+1,IF(D3=C3,D3+1,D3))","v":115},{"$f":"IF(E3=108,CHAR(E3+1),CHAR(E3))","v":"s"},{"$f":"INT(3*RAND()+1)","v":1},0,{"$f":"IF(H3=0,\"\",\"-\")","v":""},{"$f":"IF(G3=1,\"\",TEXT(G3,G3))","v":""},{"$f":"INT(3*RAND()+2)","v":2},0,{"$f":"IF(L3=0,\"\",\"-\")","v":""},{"$f":"IF(K3=1,\"\",TEXT(K3,K3))","v":"2"},{"$f":"INT(4*RAND()+1)","v":2},{"$f":"IF(O3=1,1,(IF(AND(INT(K3/2)=K3/2,INT(O3/2)=O3/2),O3+1,O3)))","v":3},{"$f":"IF(AND(INT(K3/3)=K3/3,INT(P3/3)=P3/3 ),P3+1,P3)","v":3},{"$f":"IF(AND(INT(K3/4)=K3/4,INT(Q3/4)=Q3/4 ),Q3+1,Q3)","v":3},{"$f":"IF(AND(INT($K3/5)=$K3/5,INT($R3/5)=$R3/5 ),$R3+1,$R3)","v":3},{"$f":"IF(AND(INT($K3/7)=$K3/7,INT($S3/7)=$S3/7 ),$S3+1,$S3)","v":3},{"$f":"IF(AND(INT(K3/2)=K3/2,INT(T3/2)=T3/2 ),T3+1,T3)","v":3},0,{"$f":"IF(V3=0,\" + \",\" - \")","v":" + "},{"$f":"TEXT(U3,0)","v":"3"},{"$f":"INT(8*RAND()+1)","v":5},0,{"$f":"IF(Z3=0,\"\",\"-\")","v":""},{"$f":"IF(Y3=1,\"\",TEXT(Y3,Y3))","v":"5"},{"$f":"INT(8*RAND()+1)","v":7},{"$f":"IF(AC3=1,1,(IF(AND(INT(G3/2)=G3/2,INT(AC3/2)=AC3/2),AC3+1,AC3)))","v":7},{"$f":"IF(AND(INT(G3/3)=G3/3,INT(AD3/3)=AD3/3 ),AD3+1,AD3)","v":7},{"$f":"IF(AND(INT(G3/4)=G3/4,INT(AE3/4)=AE3/4 ),AE3+1,AE3)","v":7},{"$f":"IF(AND(INT(G3/5)=G3/5,INT($AF3/5)=$AF3/5 ),$AF3+1,$AF3)","v":7},{"$f":"IF(AND(INT($G3/7)=$G3/7,INT($AG3/7)=$AG3/7 ),$AG3+1,$AG3)","v":7},{"$f":"IF(AND(INT(G3/2)=G3/2,INT(AH3/2)=AH3/2 ),AH3+1,AH3)","v":7},0,0,{"$f":"IF(AK3=0,\" + \",\" - \")","v":" + "},{"$f":"TEXT(AI3,0)","v":"7"},null,{"$f":"K3^2","v":4},{"$f":"IF(AO3=1,\"\",TEXT(AO3,0))","v":"4"},{"$f":"U3^2","v":9},{"$f":"IF(AQ3=1,\"\",TEXT(AQ3,0))","v":"9"},{"$f":"(-1)^(L3+1)*K3*(-1)^(AK3+1)*AI3+(-1)^(V3+1)*U3*(-1)^(H3+1)*G3","v":17},{"$f":"IF(ABS(AS3)=1,\"\",TEXT(ABS(AS3),0))","v":"17"},{"$f":"IF(AS3<1,\" - \",\" + \")","v":" + "},{"$f":"(-1)^(AK3+1)*AI3*(-1)^(V3+1)*U3","v":21},{"$f":"TEXT(ABS(AV3),0)","v":"21"},{"$f":"IF(AV3<1,\" - \",\" + \")","v":" + "},{"$f":"IF(V3=0,\" - \",\" + \")","v":" - "},null,null,{"$f":"3*INT(3*RAND())","v":0},null,{"$f":"CONCATENATE(\"(\",$N3,$C3,$W3,$X3,,\")\",\"(\",$J3,$C3,$AL3,$AM3,,\")\",\" =\")","v":"(2m + 3)(m + 7) ="},{"$f":"CONCATENATE($K3*$G3,$C3,CHAR(178),$AU3,$AT3,$M3,$C3,$AX3,$AW3)","v":"2m² + 17m + 21"},null,{"$f":"CONCATENATE(\"(\",$M3,$N3,$C3,$W3,$X3,,\")\",CHAR(178),\" =\")","v":"(2m + 3)² ="},{"$f":"CONCATENATE($AP3,$C3,CHAR(178),$W3,2*$U3*$K3,$C3,\" + \",$AQ3)","v":"4m² + 12m + 9"},null,{"$f":"CONCATENATE(\"(\",$N3,$C3,$W3,$X3,,\")\",\"(\",$N3,$C3,$AY3,$X3,,\")\",\" =\")","v":"(2m + 3)(2m - 3) ="},{"$f":"CONCATENATE($AP3,$C3,CHAR(178),\" - \",($X3)^2)","v":"4m² - 9"},null,{"$f":"OFFSET(BD3,0,VALUE(BB3))","v":"(2m + 3)(m + 7) ="},{"$f":"OFFSET(BE3,0,VALUE(BB3))","v":"2m² + 17m + 21"}]
[2,{"$f":"INT(24*RAND()+97)","v":115},{"$f":"IF(B4=108,CHAR(B4+1),CHAR(B4))","v":"s"},{"$f":"INT(24*RAND()+97)","v":119},{"$f":"IF(D4=B4, D4+1,IF(D4=C4,D4+1,D4))","v":119},{"$f":"IF(E4=108,CHAR(E4+1),CHAR(E4))","v":"w"},{"$f":"INT(3*RAND()+1)","v":1},0,"",{"$f":"IF(G4=1,\"\",TEXT(G4,G4))","v":""},{"$f":"INT(3*RAND()+2)","v":4},0,{"$f":"IF(L4=0,\"\",\"-\")","v":""},{"$f":"IF(K4=1,\"\",TEXT(K4,K4))","v":"4"},{"$f":"INT(4*RAND()+1)","v":4},{"$f":"IF(O4=1,1,(IF(AND(INT(K4/2)=K4/2,INT(O4/2)=O4/2),O4+1,O4)))","v":5},{"$f":"IF(AND(INT(K4/3)=K4/3,INT(P4/3)=P4/3 ),P4+1,P4)","v":5},{"$f":"IF(AND(INT(K4/4)=K4/4,INT(Q4/4)=Q4/4 ),Q4+1,Q4)","v":5},{"$f":"IF(AND(INT(K4/5)=K4/5,INT(R4/5)=R4/5 ),R4+1,R4)","v":5},{"$f":"IF(AND(INT($K4/7)=$K4/7,INT($S4/7)=$S4/7 ),$S4+1,$S4)","v":5},{"$f":"IF(AND(INT(K4/2)=K4/2,INT(T4/2)=T4/2 ),T4+1,T4)","v":5},0,{"$f":"IF(V4=0,\" + \",\" - \")","v":" + "},{"$f":"TEXT(U4,0)","v":"5"},{"$f":"INT(8*RAND()+1)","v":3},0,{"$f":"IF(Z4=0,\"\",\"-\")","v":""},{"$f":"IF(Y4=1,\"\",TEXT(Y4,Y4))","v":"3"},{"$f":"INT(8*RAND()+1)","v":6},{"$f":"IF(AC4=1,1,(IF(AND(INT(G4/2)=G4/2,INT(AC4/2)=AC4/2),AC4+1,AC4)))","v":6},{"$f":"IF(AND(INT(G4/3)=G4/3,INT(AD4/3)=AD4/3 ),AD4+1,AD4)","v":6},{"$f":"IF(AND(INT(G4/4)=G4/4,INT(AE4/4)=AE4/4 ),AE4+1,AE4)","v":6},{"$f":"IF(AND(INT(G4/5)=G4/5,INT($AF4/5)=$AF4/5 ),$AF4+1,$AF4)","v":6},{"$f":"IF(AND(INT($G4/7)=$G4/7,INT($AG4/7)=$AG4/7 ),$AG4+1,$AG4)","v":6},{"$f":"IF(AND(INT(G4/2)=G4/2,INT(AH4/2)=AH4/2 ),AH4+1,AH4)","v":6},0,0,{"$f":"IF(AK4=0,\" + \",\" - \")","v":" + "},{"$f":"TEXT(AI4,0)","v":"6"},null,{"$f":"K4^2","v":16},{"$f":"IF(AO4=1,\"\",TEXT(AO4,0))","v":"16"},{"$f":"U4^2","v":25},{"$f":"IF(AQ4=1,\"\",TEXT(AQ4,0))","v":"25"},{"$f":"(-1)^(L4+1)*K4*(-1)^(AK4+1)*AI4+(-1)^(V4+1)*U4*(-1)^(H4+1)*G4","v":29},{"$f":"IF(ABS(AS4)=1,\"\",TEXT(ABS(AS4),0))","v":"29"},{"$f":"IF(AS4<1,\" - \",\" + \")","v":" + "},{"$f":"(-1)^(AK4+1)*AI4*(-1)^(V4+1)*U4","v":30},{"$f":"TEXT(ABS(AV4),0)","v":"30"},{"$f":"IF(AV4<1,\" - \",\" + \")","v":" + "},{"$f":"IF(V4=0,\" - \",\" + \")","v":" - "},null,null,3,null,{"$f":"CONCATENATE(\"(\",$N4,$C4,$W4,$X4,,\")\",\"(\",$J4,$C4,$AL4,$AM4,,\")\",\" =\")","v":"(4s + 5)(s + 6) ="},{"$f":"CONCATENATE($K4*$G4,$C4,CHAR(178),$AU4,$AT4,$M4,$C4,$AX4,$AW4)","v":"4s² + 29s + 30"},null,{"$f":"CONCATENATE(\"(\",$M4,$N4,$C4,$W4,$X4,,\")\",CHAR(178),\" =\")","v":"(4s + 5)² ="},{"$f":"CONCATENATE($AP4,$C4,CHAR(178),$W4,2*$U4*$K4,$C4,\" + \",$AQ4)","v":"16s² + 40s + 25"},null,{"$f":"CONCATENATE(\"(\",$N4,$C4,$W4,$X4,,\")\",\"(\",$N4,$C4,$AY4,$X4,,\")\",\" =\")","v":"(4s + 5)(4s - 5) ="},{"$f":"CONCATENATE($AP4,$C4,CHAR(178),\" - \",($X4)^2)","v":"16s² - 25"},null,"(4s + 5)² =","16s² + 40s + 25"]
[3,118,"v",113,113,"q",{"$f":"INT(3*RAND()+1)","v":3},0,"","3",{"$f":"INT(3*RAND()+2)","v":3},0,"","3",1,1,1,1,1,{"$f":"IF(AND(INT($K5/7)=$K5/7,INT($S5/7)=$S5/7 ),$S5+1,$S5)","v":1},{"$f":"IF(AND(INT(K5/2)=K5/2,INT(T5/2)=T5/2 ),T5+1,T5)","v":1},0," + ",{"$f":"TEXT(U5,0)","v":"1"},5,0,"","5",4,4,4,4,4,{"$f":"IF(AND(INT($G5/7)=$G5/7,INT($AG5/7)=$AG5/7 ),$AG5+1,$AG5)","v":4},4,0,0," + ",{"$f":"TEXT(AI5,0)","v":"4"},null,9,"9",1,"",15,"15"," + ",4,"4"," + "," - ",null,null,6,null,"(3v + 1)(3v + 4) =","9v² + 15v + 4",null,"(3v + 1)² =","9v² + 6v + 1",null,"(3v + 1)(3v - 1) =","9v² - 1",null,"(3v + 1)(3v - 1) =","9v² - 1"]
[4,99,"c",115,115,"s",{"$f":"INT(3*RAND()+1)","v":2},0,"","2",{"$f":"INT(3*RAND()+2)","v":2},0,"","2",1,1,1,1,1,1,1,0," + ","1",4,0,"","4",6,7,7,7,7,7,7,0,0," + ","7",null,4,"4",1,"",16,"16"," + ",7,"7"," + "," - ",null,null,6,null,"(2c + 1)(2c + 7) =","4c² + 16c + 7",null,"(2c + 1)² =","4c² + 4c + 1",null,"(2c + 1)(2c - 1) =","4c² - 1",null,"(2c + 1)(2c - 1) =","4c² - 1"]
[5,111,"o",97,97,"a",{"$f":"INT(3*RAND()+1)","v":1},0,"","",{"$f":"INT(3*RAND()+2)","v":3},0,"","3",4,4,4,4,4,4,4,0," + ","4",5,0,"","5",4,4,4,4,4,4,4,0,0," + ","4",null,9,"9",16,"16",16,"16"," + ",16,"16"," + "," - ",null,null,6,null,"(3o + 4)(o + 4) =","3o² + 16o + 16",null,"(3o + 4)² =","9o² + 24o + 16",null,"(3o + 4)(3o - 4) =","9o² - 16",null,"(3o + 4)(3o - 4) =","9o² - 16"]
[6,102,"f",116,116,"t",{"$f":"INT(4*RAND()+1)","v":2},0,"","2",{"$f":"INT(4*RAND()+2)","v":2},0,"","2",4,5,5,5,5,5,5,0," + ","5",8,0,"","8",6,7,7,7,7,7,7,0,0," + ","7",null,4,"4",25,"25",24,"24"," + ",35,"35"," + "," - ",null,null,6,null,"(2f + 5)(2f + 7) =","4f² + 24f + 35",null,"(2f + 5)² =","4f² + 20f + 25",null,"(2f + 5)(2f - 5) =","4f² - 25",null,"(2f + 5)(2f - 5) =","4f² - 25"]
[7,106,"j",111,111,"o",3,0,"","3",4,0,"","4",1,1,1,1,1,1,1,0," + ","1",6,0,"","6",7,7,7,7,7,7,7,0,0," + ","7",null,16,"16",1,"",31,"31"," + ",7,"7"," + "," - ",null,null,3,null,"(4j + 1)(3j + 7) =","12j² + 31j + 7",null,"(4j + 1)² =","16j² + 8j + 1",null,"(4j + 1)(4j - 1) =","16j² - 1",null,"(4j + 1)² =","16j² + 8j + 1"]
[8,108,"m",115,115,"s",3,0,"","3",5,0,"","5",2,2,2,2,2,2,2,0," + ","2",6,0,"","6",3,3,4,4,4,4,4,0,0," + ","4",null,25,"25",4,"4",26,"26"," + ",8,"8"," + "," - ",null,null,0,null,"(5m + 2)(3m + 4) =","15m² + 26m + 8",null,"(5m + 2)² =","25m² + 20m + 4",null,"(5m + 2)(5m - 2) =","25m² - 4",null,"(5m + 2)(3m + 4) =","15m² + 26m + 8"]
[9,118,"v",99,99,"c",2,0,"","2",5,0,"","5",2,2,2,2,2,2,2,0," + ","2",1,0,"","",7,7,7,7,7,7,7,0,0," + ","7",null,25,"25",4,"4",39,"39"," + ",14,"14"," + "," - ",null,null,6,null,"(5v + 2)(2v + 7) =","10v² + 39v + 14",null,"(5v + 2)² =","25v² + 20v + 4",null,"(5v + 2)(5v - 2) =","25v² - 4",null,"(5v + 2)(5v - 2) =","25v² - 4"]
[10,98,"b",102,102,"f",1,0,"","",5,0,"","5",2,2,2,2,2,2,2,0," + ","2",4,0,"","4",2,2,2,2,2,2,2,0,0," + ","2",null,25,"25",4,"4",12,"12"," + ",4,"4"," + "," - ",null,null,3,null,"(5b + 2)(b + 2) =","5b² + 12b + 4",null,"(5b + 2)² =","25b² + 20b + 4",null,"(5b + 2)(5b - 2) =","25b² - 4",null,"(5b + 2)² =","25b² + 20b + 4"]
[11,99,"c",118,118,"v",3,0,"","3",3,0,"","3",4,4,4,4,4,4,4,1," - ","4",2,0,"","2",7,7,7,7,7,7,7,1,1," - ","7",null,9,"9",16,"16",-33,"33"," - ",28,"28"," + "," + ",null,null,3,null,"(3c - 4)(3c - 7) =","9c² - 33c + 28",null,"(3c - 4)² =","9c² - 24c + 16",null,"(3c - 4)(3c + 4) =","9c² - 16",null,"(3c - 4)² =","9c² - 24c + 16"]
[12,102,"f",115,115,"s",2,0,"","2",3,0,"","3",2,2,2,2,2,2,2,1," - ","2",5,0,"","5",8,9,9,9,9,9,9,1,1," - ","9",null,9,"9",4,"4",-31,"31"," - ",18,"18"," + "," + ",null,null,0,null,"(3f - 2)(2f - 9) =","6f² - 31f + 18",null,"(3f - 2)² =","9f² - 12f + 4",null,"(3f - 2)(3f + 2) =","9f² - 4",null,"(3f - 2)(2f - 9) =","6f² - 31f + 18"]
[13,114,"r",105,105,"i",4,0,"","4",3,0,"","3",2,2,2,2,2,2,2,1," - ","2",2,0,"","2",6,7,7,7,7,7,7,1,1," - ","7",null,9,"9",4,"4",-29,"29"," - ",14,"14"," + "," + ",null,null,6,null,"(3r - 2)(4r - 7) =","12r² - 29r + 14",null,"(3r - 2)² =","9r² - 12r + 4",null,"(3r - 2)(3r + 2) =","9r² - 4",null,"(3r - 2)(3r + 2) =","9r² - 4"]
[14,115,"s",120,120,"x",1,0,"","",4,0,"","4",4,5,5,5,5,5,5,1," - ","5",7,0,"","7",7,7,7,7,7,7,7,1,1," - ","7",null,16,"16",25,"25",-33,"33"," - ",35,"35"," + "," + ",null,null,0,null,"(4s - 5)(s - 7) =","4s² - 33s + 35",null,"(4s - 5)² =","16s² - 40s + 25",null,"(4s - 5)(4s + 5) =","16s² - 25",null,"(4s - 5)(s - 7) =","4s² - 33s + 35"]
[15,99,"c",117,117,"u",1,0,"","",2,0,"","2",1,1,1,1,1,1,1,1," - ","1",2,0,"","2",8,8,8,8,8,8,8,1,1," - ","8",null,4,"4",1,"",-17,"17"," - ",8,"8"," + "," + ",null,null,3,null,"(2c - 1)(c - 8) =","2c² - 17c + 8",null,"(2c - 1)² =","4c² - 4c + 1",null,"(2c - 1)(2c + 1) =","4c² - 1",null,"(2c - 1)² =","4c² - 4c + 1"]
[16,116,"t",111,111,"o",3,0,"","3",5,0,"","5",3,3,3,3,3,3,3,1," - ","3",4,0,"","4",1,1,1,1,1,1,1,1,1," - ","1",null,25,"25",9,"9",-14,"14"," - ",3,"3"," + "," + ",null,null,6,null,"(5t - 3)(3t - 1) =","15t² - 14t + 3",null,"(5t - 3)² =","25t² - 30t + 9",null,"(5t - 3)(5t + 3) =","25t² - 9",null,"(5t - 3)(5t + 3) =","25t² - 9"]
[17,106,"j",99,99,"c",3,0,"","3",5,0,"","5",4,4,4,4,4,4,4,1," - ","4",4,0,"","4",4,4,4,4,4,4,4,1,1," - ","4",null,25,"25",16,"16",-32,"32"," - ",16,"16"," + "," + ",null,null,6,null,"(5j - 4)(3j - 4) =","15j² - 32j + 16",null,"(5j - 4)² =","25j² - 40j + 16",null,"(5j - 4)(5j + 4) =","25j² - 16",null,"(5j - 4)(5j + 4) =","25j² - 16"]
[18,97,"a",117,117,"u",1,0,"","",3,0,"","3",1,1,1,1,1,1,1,1," - ","1",8,0,"","8",5,5,5,5,5,5,5,1,1," - ","5",null,9,"9",1,"",-16,"16"," - ",5,"5"," + "," + ",null,null,0,null,"(3a - 1)(a - 5) =","3a² - 16a + 5",null,"(3a - 1)² =","9a² - 6a + 1",null,"(3a - 1)(3a + 1) =","9a² - 1",null,"(3a - 1)(a - 5) =","3a² - 16a + 5"]
[19,116,"t",108,108,"m",4,0,"","4",3,0,"","3",2,2,2,2,2,2,2,1," - ","2",4,0,"","4",8,9,9,9,9,9,9,1,1," - ","9",null,9,"9",4,"4",-35,"35"," - ",18,"18"," + "," + ",null,null,3,null,"(3t - 2)(4t - 9) =","12t² - 35t + 18",null,"(3t - 2)² =","9t² - 12t + 4",null,"(3t - 2)(3t + 2) =","9t² - 4",null,"(3t - 2)² =","9t² - 12t + 4"]
[20,117,"u",110,110,"n",2,0,"","2",4,0,"","4",3,3,3,3,3,3,3,1," - ","3",2,0,"","2",6,7,7,7,7,7,7,1,1," - ","7",null,16,"16",9,"9",-34,"34"," - ",21,"21"," + "," + ",null,null,3,null,"(4u - 3)(2u - 7) =","8u² - 34u + 21",null,"(4u - 3)² =","16u² - 24u + 9",null,"(4u - 3)(4u + 3) =","16u² - 9",null,"(4u - 3)² =","16u² - 24u + 9"]
[21,115,"s",115,116,"t",3,0,"","3",5,0,"","5",3,3,3,3,3,3,3,{"$f":"INT(2*RAND())","v":1}," - ","3",3,0,"","3",1,1,1,1,1,1,1,{"$f":"INT(2*RAND())","v":0},{"$f":"IF((AND(AI23=U23,MOD(AJ23+1,2)=V23)),MOD(AJ23+1,2),AJ23)","v":0}," + ","1",null,25,"25",9,"9",-4,"4"," - ",-3,"3"," - "," + ",null,null,3,null,"(5s - 3)(3s + 1) =","15s² - 4s - 3",null,"(5s - 3)² =","25s² - 30s + 9",null,"(5s - 3)(5s + 3) =","25s² - 9",null,"(5s - 3)² =","25s² - 30s + 9"]
[22,111,"o",97,97,"a",2,0,"","2",2,0,"","2",1,1,1,1,1,1,1,1," - ","1",4,0,"","4",3,3,3,3,3,3,3,0,{"$f":"IF((AND(AI24=U24,MOD(AJ24+1,2)=V24)),MOD(AJ24+1,2),AJ24)","v":0}," + ","3",null,4,"4",1,"",4,"4"," + ",-3,"3"," - "," + ",null,null,6,null,"(2o - 1)(2o + 3) =","4o² + 4o - 3",null,"(2o - 1)² =","4o² - 4o + 1",null,"(2o - 1)(2o + 1) =","4o² - 1",null,"(2o - 1)(2o + 1) =","4o² - 1"]
[23,109,"m",104,104,"h",4,0,"","4",5,0,"","5",3,3,3,3,3,3,3,1," - ","3",1,0,"","",6,7,7,7,7,7,7,1,1," - ","7",null,25,"25",9,"9",-47,"47"," - ",21,"21"," + "," + ",null,null,3,null,"(5m - 3)(4m - 7) =","20m² - 47m + 21",null,"(5m - 3)² =","25m² - 30m + 9",null,"(5m - 3)(5m + 3) =","25m² - 9",null,"(5m - 3)² =","25m² - 30m + 9"]
[24,98,"b",117,117,"u",2,0,"","2",3,0,"","3",2,2,2,2,2,2,2,0," + ","2",7,0,"","7",2,3,3,3,3,3,3,1,1," - ","3",null,9,"9",4,"4",-5,"5"," - ",-6,"6"," - "," - ",null,null,0,null,"(3b + 2)(2b - 3) =","6b² - 5b - 6",null,"(3b + 2)² =","9b² + 12b + 4",null,"(3b + 2)(3b - 2) =","9b² - 4",null,"(3b + 2)(2b - 3) =","6b² - 5b - 6"]
[25,101,"e",98,98,"b",1,0,"","",2,0,"","2",1,1,1,1,1,1,1,0," + ","1",3,0,"","3",3,3,3,3,3,3,3,0,0," + ","3",null,4,"4",1,"",7,"7"," + ",3,"3"," + "," - ",null,null,0,null,"(2e + 1)(e + 3) =","2e² + 7e + 3",null,"(2e + 1)² =","4e² + 4e + 1",null,"(2e + 1)(2e - 1) =","4e² - 1",null,"(2e + 1)(e + 3) =","2e² + 7e + 3"]
[26,110,"n",109,109,"m",{"$f":"INT(8*RAND()+2)","v":2},0,"","2",{"$f":"INT(8*RAND()+2)","v":2},0,"","2",{"$f":"INT(7*RAND()+1)","v":1},1,1,1,1,1,1,1," - ","1",{"$f":"INT(8*RAND()+2)","v":4},0,"","4",{"$f":"INT(12*RAND()+1)","v":5},5,5,5,5,5,5,1,1," - ","5",null,4,"4",1,"",-12,"12"," - ",5,"5"," + "," + ",null,null,0,null,{"$f":"CONCATENATE(\"(\",$N28,$C28,$W28,$X28,,\")\",\"(\",$J28,$C28,$AL28,$AM28,\")\",\" =\")","v":"(2n - 1)(2n - 5) ="},{"$f":"CONCATENATE($K28*$G28,$C28,CHAR(178),$AU28,$AT28,$C28,$AX28,$AW28)","v":"4n² - 12n + 5"},null,{"$f":"CONCATENATE(\"(\",$M28,$N28,$C28,$W28,$X28,,\")\",CHAR(178),\" =\")","v":"(2n - 1)² ="},{"$f":"CONCATENATE($AP28,$C28,CHAR(178),$W28,2*$U28*$K28,$C28,\" + \",$AQ28)","v":"4n² - 4n + 1"},null,{"$f":"CONCATENATE(\"(\",$N28,$C28,$W28,$X28,,\")\",\"(\",$N28,$C28,$AY28,$X28,,\")\",\" =\")","v":"(2n - 1)(2n + 1) ="},{"$f":"CONCATENATE($AP28,$C28,CHAR(178),\" - \",($X28)^2)","v":"4n² - 1"},null,"(2n - 1)(2n - 5) =","4n² - 12n + 5"]
[27,100,"d",119,119,"w",4,0,"","4",{"$f":"INT(8*RAND()+2)","v":7},0,"","7",2,2,2,2,2,2,2,0," + ","2",{"$f":"INT(8*RAND()+2)","v":6},0,"","6",9,9,9,9,9,9,9,0,0," + ","9",null,49,"49",4,"4",71,"71"," + ",18,"18"," + "," - ",null,null,0,null,{"$f":"CONCATENATE(\"(\",$N29,$C29,$W29,$X29,,\")\",\"(\",$J29,$C29,$AL29,$AM29,\")\",\" =\")","v":"(7d + 2)(4d + 9) ="},{"$f":"CONCATENATE($K29*$G29,$C29,CHAR(178),$AU29,$AT29,$C29,$AX29,$AW29)","v":"28d² + 71d + 18"},null,{"$f":"CONCATENATE(\"(\",$M29,$N29,$C29,$W29,$X29,,\")\",CHAR(178),\" =\")","v":"(7d + 2)² ="},{"$f":"CONCATENATE($AP29,$C29,CHAR(178),$W29,2*$U29*$K29,$C29,\" + \",$AQ29)","v":"49d² + 28d + 4"},null,{"$f":"CONCATENATE(\"(\",$N29,$C29,$W29,$X29,,\")\",\"(\",$N29,$C29,$AY29,$X29,,\")\",\" =\")","v":"(7d + 2)(7d - 2) ="},{"$f":"CONCATENATE($AP29,$C29,CHAR(178),\" - \",($X29)^2)","v":"49d² - 4"},null,"(7d + 2)(4d + 9) =","28d² + 71d + 18"]
[28,115,"s",103,103,"g",4,0,"","4",8,0,"","8",3,3,3,3,3,3,3,0," + ","3",8,0,"","8",6,7,7,7,7,7,7,0,0," + ","7",null,64,"64",9,"9",68,"68"," + ",21,"21"," + "," - ",null,null,3,null,"(8s + 3)(4s + 7) =","32s² + 68s + 21",null,"(8s + 3)² =","64s² + 48s + 9",null,"(8s + 3)(8s - 3) =","64s² - 9",null,"(8s + 3)² =","64s² + 48s + 9"]
[29,115,"s",109,109,"m",9,0,"","9",2,0,"","2",6,7,7,7,7,7,7,0," + ","7",4,0,"","4",6,6,7,7,7,7,7,0,0," + ","7",null,4,"4",49,"49",77,"77"," + ",49,"49"," + "," - ",null,null,6,null,"(2s + 7)(9s + 7) =","18s² + 77s + 49",null,"(2s + 7)² =","4s² + 28s + 49",null,"(2s + 7)(2s - 7) =","4s² - 49",null,"(2s + 7)(2s - 7) =","4s² - 49"]
[30,118,"v",100,100,"d",4,0,"","4",9,0,"","9",3,3,4,4,4,4,4,1," - ","4",8,0,"","8",9,9,9,9,9,9,9,0,0," + ","9",null,81,"81",16,"16",65,"65"," + ",-36,"36"," - "," + ",null,null,6,null,"(9v - 4)(4v + 9) =","36v² + 65v - 36",null,"(9v - 4)² =","81v² - 72v + 16",null,"(9v - 4)(9v + 4) =","81v² - 16",null,"(9v - 4)(9v + 4) =","81v² - 16"]
[31,98,"b",117,117,"u",6,0,"","6",9,0,"","9",4,4,4,4,4,4,4,0," + ","4",4,0,"","4",4,5,5,5,5,5,5,0,0," + ","5",null,81,"81",16,"16",69,"69"," + ",20,"20"," + "," - ",null,null,0,null,"(9b + 4)(6b + 5) =","54b² + 69b + 20",null,"(9b + 4)² =","81b² + 72b + 16",null,"(9b + 4)(9b - 4) =","81b² - 16",null,"(9b + 4)(6b + 5) =","54b² + 69b + 20"]
[32,120,"x",115,115,"s",3,0,"","3",2,0,"","2",4,5,5,5,5,5,5,0," + ","5",4,0,"","4",3,3,4,4,4,4,4,1,1," - ","4",null,4,"4",25,"25",7,"7"," + ",-20,"20"," - "," - ",null,null,0,null,"(2x + 5)(3x - 4) =","6x² + 7x - 20",null,"(2x + 5)² =","4x² + 20x + 25",null,"(2x + 5)(2x - 5) =","4x² - 25",null,"(2x + 5)(3x - 4) =","6x² + 7x - 20"]
[33,120,"x",100,100,"d",3,0,{"$f":"IF(H35=0,\"\",\"-\")","v":""},"3",9,0,"","9",4,4,4,4,4,4,4,{"$f":"INT(2*RAND())","v":0}," + ","4",8,0,"","8",1,1,1,1,1,1,1,0,0," + ","1",null,81,"81",16,"16",21,"21"," + ",4,"4"," + "," - ",null,null,{"$f":"3*INT(3*RAND())","v":6},null,"(9x + 4)(3x + 1) =","27x² + 21x + 4",null,"(9x + 4)² =","81x² + 72x + 16",null,"(9x + 4)(9x - 4) =","81x² - 16",null,{"$f":"OFFSET(BD35,0,VALUE(BB35))","v":"(9x + 4)(9x - 4) ="},{"$f":"OFFSET(BE35,0,VALUE(BB35))","v":"81x² - 16"}]
[34,113,"q",113,114,"r",5,0,"","5",7,0,"","7",7,7,7,7,7,8,8,1," - ","8",2,0,"","2",2,2,2,2,2,2,2,1,1," - ","2",null,49,"49",64,"64",-54,"54"," - ",16,"16"," + "," + ",null,null,6,null,"(7q - 8)(5q - 2) =","35q² - 54q + 16",null,"(7q - 8)² =","49q² - 112q + 64",null,"(7q - 8)(7q + 8) =","49q² - 64",null,"(7q - 8)(7q + 8) =","49q² - 64"]
[35,106,"j",116,116,"t",3,0,"","3",2,0,"","2",2,3,3,3,3,3,3,1," - ","3",8,0,"","8",8,8,8,8,8,8,8,1,1," - ","8",null,4,"4",9,"9",-25,"25"," - ",24,"24"," + "," + ",null,null,3,null,"(2j - 3)(3j - 8) =","6j² - 25j + 24",null,"(2j - 3)² =","4j² - 12j + 9",null,"(2j - 3)(2j + 3) =","4j² - 9",null,"(2j - 3)² =","4j² - 12j + 9"]
[36,98,"b",110,110,"n",7,0,"","7",6,0,"","6",1,1,1,1,1,1,1,1," - ","1",3,0,"","3",10,10,10,10,10,10,10,0,0," + ","10",null,36,"36",1,"",53,"53"," + ",-10,"10"," - "," + ",null,null,6,null,"(6b - 1)(7b + 10) =","42b² + 53b - 10",null,"(6b - 1)² =","36b² - 12b + 1",null,"(6b - 1)(6b + 1) =","36b² - 1",null,"(6b - 1)(6b + 1) =","36b² - 1"]
[37,118,"v",110,110,"n",8,0,"","8",9,0,"","9",2,2,2,2,2,2,2,1," - ","2",6,0,"","6",11,11,11,11,11,11,11,1,1," - ","11",null,81,"81",4,"4",-115,"115"," - ",22,"22"," + "," + ",null,null,0,null,"(9v - 2)(8v - 11) =","72v² - 115v + 22",null,"(9v - 2)² =","81v² - 36v + 4",null,"(9v - 2)(9v + 2) =","81v² - 4",null,"(9v - 2)(8v - 11) =","72v² - 115v + 22"]
[38,99,"c",118,118,"v",6,0,"","6",7,0,"","7",4,4,4,4,4,4,4,0," + ","4",9,0,"","9",10,11,11,11,11,11,11,0,0," + ","11",null,49,"49",16,"16",101,"101"," + ",44,"44"," + "," - ",null,null,3,null,"(7c + 4)(6c + 11) =","42c² + 101c + 44",null,"(7c + 4)² =","49c² + 56c + 16",null,"(7c + 4)(7c - 4) =","49c² - 16",null,"(7c + 4)² =","49c² + 56c + 16"]
[39,105,"i",99,99,"c",8,0,"","8",3,0,"","3",2,2,2,2,2,2,2,1," - ","2",6,0,"","6",6,7,7,7,7,7,7,0,0," + ","7",null,9,"9",4,"4",5,"5"," + ",-14,"14"," - "," + ",null,null,6,null,"(3i - 2)(8i + 7) =","24i² + 5i - 14",null,"(3i - 2)² =","9i² - 12i + 4",null,"(3i - 2)(3i + 2) =","9i² - 4",null,"(3i - 2)(3i + 2) =","9i² - 4"]
[40,116,"t",114,114,"r",6,0,"","6",4,0,"","4",7,7,7,7,7,7,7,0," + ","7",9,0,"","9",12,13,13,13,13,13,13,0,0," + ","13",null,16,"16",49,"49",94,"94"," + ",91,"91"," + "," - ",null,null,6,null,"(4t + 7)(6t + 13) =","24t² + 94t + 91",null,"(4t + 7)² =","16t² + 56t + 49",null,"(4t + 7)(4t - 7) =","16t² - 49",null,"(4t + 7)(4t - 7) =","16t² - 49"]
[41,110,"n",101,101,"e",4,0,"","4",7,0,"","7",4,4,4,4,4,4,4,0," + ","4",5,0,"","5",7,7,7,7,7,7,7,1,1," - ","7",null,49,"49",16,"16",-33,"33"," - ",-28,"28"," - "," - ",null,null,3,null,"(7n + 4)(4n - 7) =","28n² - 33n - 28",null,"(7n + 4)² =","49n² + 56n + 16",null,"(7n + 4)(7n - 4) =","49n² - 16",null,"(7n + 4)² =","49n² + 56n + 16"]
[42,100,"d",97,97,"a",3,0,"","3",6,0,"","6",5,5,5,5,5,5,5,1," - ","5",5,0,"","5",4,4,4,4,4,4,4,0,0," + ","4",null,36,"36",25,"25",9,"9"," + ",-20,"20"," - "," + ",null,null,6,null,"(6d - 5)(3d + 4) =","18d² + 9d - 20",null,"(6d - 5)² =","36d² - 60d + 25",null,"(6d - 5)(6d + 5) =","36d² - 25",null,"(6d - 5)(6d + 5) =","36d² - 25"]
[43,104,"h",113,113,"q",6,0,"","6",8,0,"","8",4,5,5,5,5,5,5,1," - ","5",7,0,"","7",9,9,10,10,10,10,11,0,0," + ","11",null,64,"64",25,"25",58,"58"," + ",-55,"55"," - "," + ",null,null,3,null,"(8h - 5)(6h + 11) =","48h² + 58h - 55",null,"(8h - 5)² =","64h² - 80h + 25",null,"(8h - 5)(8h + 5) =","64h² - 25",null,"(8h - 5)² =","64h² - 80h + 25"]
[44,114,"r",100,100,"d",9,0,"","9",8,0,"","8",7,7,7,7,7,7,7,0," + ","7",8,0,"","8",7,7,7,7,7,7,7,1,0," + ","7",null,64,"64",49,"49",119,"119"," + ",49,"49"," + "," - ",null,null,6,null,"(8r + 7)(9r + 7) =","72r² + 119r + 49",null,"(8r + 7)² =","64r² + 112r + 49",null,"(8r + 7)(8r - 7) =","64r² - 49",null,"(8r + 7)(8r - 7) =","64r² - 49"]
[45,97,"a",113,113,"q",7,0,"","7",4,0,"","4",5,5,5,5,5,5,5,1," - ","5",6,0,"","6",10,10,10,10,10,10,10,1,1," - ","10",null,16,"16",25,"25",-75,"75"," - ",50,"50"," + "," + ",null,null,3,null,"(4a - 5)(7a - 10) =","28a² - 75a + 50",null,"(4a - 5)² =","16a² - 40a + 25",null,"(4a - 5)(4a + 5) =","16a² - 25",null,"(4a - 5)² =","16a² - 40a + 25"]
[46,107,"k",97,97,"a",3,0,"","3",6,0,"","6",6,7,7,7,7,7,7,0," + ","7",3,0,"","3",7,7,7,7,7,7,7,0,0," + ","7",null,36,"36",49,"49",63,"63"," + ",49,"49"," + "," - ",null,null,0,null,"(6k + 7)(3k + 7) =","18k² + 63k + 49",null,"(6k + 7)² =","36k² + 84k + 49",null,"(6k + 7)(6k - 7) =","36k² - 49",null,"(6k + 7)(3k + 7) =","18k² + 63k + 49"]
[47,119,"w",99,99,"c",9,0,"","9",8,0,"","8",3,3,3,3,3,3,3,0," + ","3",8,0,"","8",12,12,13,13,13,13,13,1,1," - ","13",null,64,"64",9,"9",-77,"77"," - ",-39,"39"," - "," - ",null,null,6,null,"(8w + 3)(9w - 13) =","72w² - 77w - 39",null,"(8w + 3)² =","64w² + 48w + 9",null,"(8w + 3)(8w - 3) =","64w² - 9",null,"(8w + 3)(8w - 3) =","64w² - 9"]
[48,97,"a",106,106,"j",2,0,"","2",5,0,"","5",4,4,4,4,4,4,4,1," - ","4",5,0,"","5",7,7,7,7,7,7,7,0,0," + ","7",null,25,"25",16,"16",27,"27"," + ",-28,"28"," - "," + ",null,null,6,null,"(5a - 4)(2a + 7) =","10a² + 27a - 28",null,"(5a - 4)² =","25a² - 40a + 16",null,"(5a - 4)(5a + 4) =","25a² - 16",null,"(5a - 4)(5a + 4) =","25a² - 16"]
[49,110,"n",111,111,"o",9,0,"","9",6,0,"","6",5,5,5,5,5,5,5,0," + ","5",7,0,"","7",5,5,5,5,5,5,5,1,0," + ","5",null,36,"36",25,"25",75,"75"," + ",25,"25"," + "," - ",null,null,6,null,"(6n + 5)(9n + 5) =","54n² + 75n + 25",null,"(6n + 5)² =","36n² + 60n + 25",null,"(6n + 5)(6n - 5) =","36n² - 25",null,"(6n + 5)(6n - 5) =","36n² - 25"]
[50,105,"i",100,100,"d",7,0,"","7",7,0,"","7",1,1,1,1,1,1,1,0," + ","1",9,0,"","9",12,12,12,12,12,12,12,1,1," - ","12",null,49,"49",1,"",-77,"77"," - ",-12,"12"," - "," - ",null,null,0,null,"(7i + 1)(7i - 12) =","49i² - 77i - 12",null,"(7i + 1)² =","49i² + 14i + 1",null,"(7i + 1)(7i - 1) =","49i² - 1",null,"(7i + 1)(7i - 12) =","49i² - 77i - 12"]
[51,105,"i",99,99,"c",{"$f":"INT(9*RAND()+1)","v":9},0,"","9",{"$f":"INT(9*RAND()+1)","v":3},0,"","3",5,5,5,5,5,5,5,1," - ",{"$f":"IF(U53=1,\"\",TEXT(U53,0))","v":"5"},{"$f":"INT(9*RAND()+1)","v":4},0,"","4",3,3,4,4,4,4,4,1,1," - ",{"$f":"IF(AI53=1,\"\",TEXT(AI53,0))","v":"4"},null,9,"9",25,"25",-57,"57"," - ",20,{"$f":"IF(AV53=1,\"\",TEXT(ABS(AV53),0))","v":"20"}," + "," + ",null,null,0,null,{"$f":"CONCATENATE(\"(\",$N53,$C53,$W53,$X53,$F53,\")\",\"(\",$J53,$C53,$AL53,$AM53,$F53,\")\",\" =\")","v":"(3i - 5c)(9i - 4c) ="},{"$f":"CONCATENATE($K53*$G53,$C53,CHAR(178),$AU53,$AT53,$C53,$F53,$AX53,$AW53,$F53,CHAR(178))","v":"27i² - 57ic + 20c²"},null,{"$f":"CONCATENATE(\"(\",$N53,$C53,$W53,$X53,$F53,\")\",CHAR(178),\" =\")","v":"(3i - 5c)² ="},{"$f":"CONCATENATE($AP53,$C53,CHAR(178),$W53,2*$U53*$K53,$C53,$F53,\" + \",$AR53,$F53,CHAR(178))","v":"9i² - 30ic + 25c²"},null,{"$f":"CONCATENATE(\"(\",$N53,$C53,$W53,$X53,$F53,\")\",\"(\",$N53,$C53,$AY53,$X53,$F53,\")\",\" =\")","v":"(3i - 5c)(3i + 5c) ="},{"$f":"CONCATENATE($AP53,$C53,CHAR(178),\" - \",($AR53),$F53,CHAR(178))","v":"9i² - 25c²"},null,"(3i - 5c)(9i - 4c) =","27i² - 57ic + 20c²"]
[52,117,"u",97,97,"a",7,0,"","7",9,0,"","9",6,6,7,7,7,7,7,0," + ",{"$f":"IF(U54=1,\"\",TEXT(U54,0))","v":"7"},5,0,"","5",2,2,2,2,2,2,2,0,0," + ",{"$f":"IF(AI54=1,\"\",TEXT(AI54,0))","v":"2"},null,81,"81",49,"49",67,"67"," + ",14,"14"," + "," - ",null,null,6,null,{"$f":"CONCATENATE(\"(\",$N54,$C54,$W54,$X54,$F54,\")\",\"(\",$J54,$C54,$AL54,$AM54,$F54,\")\",\" =\")","v":"(9u + 7a)(7u + 2a) ="},{"$f":"CONCATENATE($K54*$G54,$C54,CHAR(178),$AU54,$AT54,$C54,$F54,$AX54,$AW54,$F54,CHAR(178))","v":"63u² + 67ua + 14a²"},null,{"$f":"CONCATENATE(\"(\",$N54,$C54,$W54,$X54,$F54,\")\",CHAR(178),\" =\")","v":"(9u + 7a)² ="},{"$f":"CONCATENATE($AP54,$C54,CHAR(178),$W54,2*$U54*$K54,$C54,$F54,\" + \",$AR54,$F54,CHAR(178))","v":"81u² + 126ua + 49a²"},null,{"$f":"CONCATENATE(\"(\",$N54,$C54,$W54,$X54,$F54,\")\",\"(\",$N54,$C54,$AY54,$X54,$F54,\")\",\" =\")","v":"(9u + 7a)(9u - 7a) ="},{"$f":"CONCATENATE($AP54,$C54,CHAR(178),\" - \",($AR54),$F54,CHAR(178))","v":"81u² - 49a²"},null,"(9u + 7a)(9u - 7a) =","81u² - 49a²"]
[53,107,"k",115,115,"s",3,0,"","3",7,0,"","7",4,4,4,4,4,4,4,0," + ","4",7,0,"","7",4,4,4,4,4,4,4,1,0," + ","4",null,49,"49",16,"16",40,"40"," + ",16,"16"," + "," - ",null,null,3,null,"(7k + 4s)(3k + 4s) =","21k² + 40ks + 16s²",null,"(7k + 4s)² =","49k² + 56ks + 16s²",null,"(7k + 4s)(7k - 4s) =","49k² - 16s²",null,"(7k + 4s)² =","49k² + 56ks + 16s²"]
[54,98,"b",108,108,"m",3,0,"","3",8,0,"","8",3,3,3,3,3,3,3,1," - ","3",5,0,"","5",1,1,1,1,1,1,1,0,0," + ","",null,64,"64",9,"9",-1,""," - ",-3,"3"," - "," + ",null,null,3,null,"(8b - 3m)(3b + m) =","24b² - bm - 3m²",null,"(8b - 3m)² =","64b² - 48bm + 9m²",null,"(8b - 3m)(8b + 3m) =","64b² - 9m²",null,"(8b - 3m)² =","64b² - 48bm + 9m²"]
[55,101,"e",113,113,"q",7,0,"","7",3,0,"","3",1,1,1,1,1,1,1,1," - ","",3,0,"","3",4,4,4,4,4,4,4,0,0," + ","4",null,9,"9",1,"",5,"5"," + ",-4,"4"," - "," + ",null,null,3,null,"(3e - q)(7e + 4q) =","21e² + 5eq - 4q²",null,"(3e - q)² =","9e² - 6eq + q²",null,"(3e - q)(3e + q) =","9e² - q²",null,"(3e - q)² =","9e² - 6eq + q²"]
[56,105,"i",98,98,"b",3,0,"","3",6,0,"","6",6,7,7,7,7,7,7,1," - ","7",4,0,"","4",6,6,7,7,7,7,7,0,1," - ","7",null,36,"36",49,"49",-63,"63"," - ",49,"49"," + "," + ",null,null,6,null,"(6i - 7b)(3i - 7b) =","18i² - 63ib + 49b²",null,"(6i - 7b)² =","36i² - 84ib + 49b²",null,"(6i - 7b)(6i + 7b) =","36i² - 49b²",null,"(6i - 7b)(6i + 7b) =","36i² - 49b²"]
[57,117,"u",104,104,"h",1,0,"","",6,0,"","6",5,5,5,5,5,5,5,0," + ","5",1,0,"","",2,2,2,2,2,2,2,0,0," + ","2",null,36,"36",25,"25",17,"17"," + ",10,"10"," + "," - ",null,null,3,null,"(6u + 5h)(u + 2h) =","6u² + 17uh + 10h²",null,"(6u + 5h)² =","36u² + 60uh + 25h²",null,"(6u + 5h)(6u - 5h) =","36u² - 25h²",null,"(6u + 5h)² =","36u² + 60uh + 25h²"]
[58,113,"q",111,111,"o",8,0,"","8",1,0,"","",1,1,1,1,1,1,1,1," - ","",8,0,"","8",11,11,11,11,11,11,11,0,0," + ","11",null,1,"",1,"",3,"3"," + ",-11,"11"," - "," + ",null,null,3,null,"(q - o)(8q + 11o) =","8q² + 3qo - 11o²",null,"(q - o)² =","q² - 2qo + o²",null,"(q - o)(q + o) =","q² - o²",null,"(q - o)² =","q² - 2qo + o²"]
[59,110,"n",108,108,"m",4,0,"","4",2,0,"","2",4,5,5,5,5,5,5,0," + ","5",1,0,"","",1,1,1,1,1,1,1,1,1," - ","",null,4,"4",25,"25",18,"18"," + ",-5,"5"," - "," - ",null,null,0,null,"(2n + 5m)(4n - m) =","8n² + 18nm - 5m²",null,"(2n + 5m)² =","4n² + 20nm + 25m²",null,"(2n + 5m)(2n - 5m) =","4n² - 25m²",null,"(2n + 5m)(4n - m) =","8n² + 18nm - 5m²"]
[60,112,"p",101,101,"e",8,0,"","8",8,0,"","8",4,5,5,5,5,5,5,1," - ","5",8,0,"","8",7,7,7,7,7,7,7,0,0," + ","7",null,64,"64",25,"25",16,"16"," + ",-35,"35"," - "," + ",null,null,3,null,"(8p - 5e)(8p + 7e) =","64p² + 16pe - 35e²",null,"(8p - 5e)² =","64p² - 80pe + 25e²",null,"(8p - 5e)(8p + 5e) =","64p² - 25e²",null,"(8p - 5e)² =","64p² - 80pe + 25e²"]
[61,97,"a",120,120,"x",6,0,"","6",6,0,"","6",4,5,5,5,5,5,5,1," - ","5",1,0,"","",4,5,5,5,5,5,5,0,1," - ","5",null,36,"36",25,"25",-60,"60"," - ",25,"25"," + "," + ",null,null,0,null,"(6a - 5x)(6a - 5x) =","36a² - 60ax + 25x²",null,"(6a - 5x)² =","36a² - 60ax + 25x²",null,"(6a - 5x)(6a + 5x) =","36a² - 25x²",null,"(6a - 5x)(6a - 5x) =","36a² - 60ax + 25x²"]
[62,113,"q",101,101,"e",3,0,"","3",9,0,"","9",5,5,5,5,5,5,5,1," - ","5",3,0,"","3",9,9,10,10,10,10,10,0,0," + ","10",null,81,"81",25,"25",75,"75"," + ",-50,"50"," - "," + ",null,null,3,null,"(9q - 5e)(3q + 10e) =","27q² + 75qe - 50e²",null,"(9q - 5e)² =","81q² - 90qe + 25e²",null,"(9q - 5e)(9q + 5e) =","81q² - 25e²",null,"(9q - 5e)² =","81q² - 90qe + 25e²"]
[63,103,"g",115,115,"s",3,0,"","3",4,0,"","4",3,3,3,3,3,3,3,1," - ","3",5,0,"","5",7,7,7,7,7,7,7,1,1," - ","7",null,16,"16",9,"9",-37,"37"," - ",21,"21"," + "," + ",null,null,6,null,"(4g - 3s)(3g - 7s) =","12g² - 37gs + 21s²",null,"(4g - 3s)² =","16g² - 24gs + 9s²",null,"(4g - 3s)(4g + 3s) =","16g² - 9s²",null,"(4g - 3s)(4g + 3s) =","16g² - 9s²"]
[64,112,"p",100,100,"d",1,0,"","",2,0,"","2",5,5,5,5,5,5,5,0," + ","5",8,0,"","8",2,2,2,2,2,2,2,1,1," - ","2",null,4,"4",25,"25",1,""," + ",-10,"10"," - "," - ",null,null,6,null,"(2p + 5d)(p - 2d) =","2p² + pd - 10d²",null,"(2p + 5d)² =","4p² + 20pd + 25d²",null,"(2p + 5d)(2p - 5d) =","4p² - 25d²",null,"(2p + 5d)(2p - 5d) =","4p² - 25d²"]
[65,120,"x",102,102,"f",3,0,{"$f":"IF(H67=0,\"\",\"-\")","v":""},"3",{"$f":"INT(9*RAND()+1)","v":8},0,"","8",2,3,3,3,3,3,3,{"$f":"INT(2*RAND())","v":0}," + ","3",9,0,"","9",1,1,1,1,1,1,1,1,1," - ","",null,64,"64",9,"9",1,""," + ",-3,"3"," - "," - ",null,null,{"$f":"3*INT(3*RAND())","v":0},null,"(8x + 3f)(3x - f) =","24x² + xf - 3f²",null,"(8x + 3f)² =","64x² + 48xf + 9f²",null,"(8x + 3f)(8x - 3f) =","64x² - 9f²",null,{"$f":"OFFSET(BD67,0,VALUE(BB67))","v":"(8x + 3f)(3x - f) ="},{"$f":"OFFSET(BE67,0,VALUE(BB67))","v":"24x² + xf - 3f²"}]
[66,{"$f":"INT(24*RAND()+97)","v":107},{"$f":"IF(B68=108,CHAR(B68+1),CHAR(B68))","v":"k"},{"$f":"INT(24*RAND()+97)","v":103},{"$f":"IF(D68=B68, D68+1,IF(D68=C68,D68+1,D68))","v":103},{"$f":"IF(E68=108,CHAR(E68+1),CHAR(E68))","v":"g"},1,0,"",{"$f":"IF(G68=1,\"\",TEXT(G68,G68))","v":""},3,0,{"$f":"IF(L68=0,\"\",\"-\")","v":""},{"$f":"IF(K68=1,\"\",TEXT(K68,K68))","v":"3"},{"$f":"INT(7*RAND()+1)","v":4},{"$f":"IF(O68=1,1,(IF(AND(INT(K68/2)=K68/2,INT(O68/2)=O68/2),O68+1,O68)))","v":4},{"$f":"IF(AND(INT(K68/3)=K68/3,INT(P68/3)=P68/3 ),P68+1,P68)","v":4},{"$f":"IF(AND(INT(K68/4)=K68/4,INT(Q68/4)=Q68/4 ),Q68+1,Q68)","v":4},{"$f":"IF(AND(INT(K68/5)=K68/5,INT(R68/5)=R68/5 ),R68+1,R68)","v":4},4,4,1,{"$f":"IF(V68=0,\" + \",\" - \")","v":" - "},"4",6,0,{"$f":"IF(Z68=0,\"\",\"-\")","v":""},{"$f":"IF(Y68=1,\"\",TEXT(Y68,Y68))","v":"6"},{"$f":"INT(12*RAND()+1)","v":7},{"$f":"IF(AC68=1,1,(IF(AND(INT(G68/2)=G68/2,INT(AC68/2)=AC68/2),AC68+1,AC68)))","v":7},{"$f":"IF(AND(INT(G68/3)=G68/3,INT(AD68/3)=AD68/3 ),AD68+1,AD68)","v":7},{"$f":"IF(AND(INT(G68/4)=G68/4,INT(AE68/4)=AE68/4 ),AE68+1,AE68)","v":7},{"$f":"IF(AND(INT(G68/5)=G68/5,INT($AF68/5)=$AF68/5 ),$AF68+1,$AF68)","v":7},7,{"$f":"IF(AND(INT(G68/2)=G68/2,INT(AH68/2)=AH68/2 ),AH68+1,AH68)","v":7},0,0,{"$f":"IF(AK68=0,\" + \",\" - \")","v":" + "},"7",null,{"$f":"K68^2","v":9},{"$f":"IF(AO68=1,\"\",TEXT(AO68,0))","v":"9"},{"$f":"U68^2","v":16},{"$f":"IF(AQ68=1,\"\",TEXT(AQ68,0))","v":"16"},{"$f":"(-1)^(L68+1)*K68*(-1)^(AK68+1)*AI68+(-1)^(V68+1)*U68*(-1)^(H68+1)*G68","v":17},{"$f":"IF(ABS(AS68)=1,\"\",TEXT(ABS(AS68),0))","v":"17"},{"$f":"IF(AS68<1,\" - \",\" + \")","v":" + "},{"$f":"(-1)^(AK68+1)*AI68*(-1)^(V68+1)*U68","v":-28},{"$f":"IF(AV68=1,\"\",TEXT(ABS(AV68),0))","v":"28"},{"$f":"IF(AV68<1,\" - \",\" + \")","v":" - "},{"$f":"IF(V68=0,\" - \",\" + \")","v":" + "},null,null,6,null,"(3k - 4g)(k + 7g) =","3k² + 17kg - 28g²",null,"(3k - 4g)² =","9k² - 24kg + 16g²",null,"(3k - 4g)(3k + 4g) =","9k² - 16g²",null,"(3k - 4g)(3k + 4g) =","9k² - 16g²"]
[67,112,"p",103,103,"g",4,0,"","4",3,0,"","3",4,4,4,4,4,{"$f":"IF(AND(INT($K69/7)=$K69/7,INT($S69/7)=$S69/7 ),$S69+1,$S69)","v":4},{"$f":"IF(AND(INT(K69/2)=K69/2,INT(T69/2)=T69/2 ),T69+1,T69)","v":4},0," + ","4",1,0,"","",12,13,13,13,13,{"$f":"IF(AND(INT($G69/7)=$G69/7,INT($AG69/7)=$AG69/7 ),$AG69+1,$AG69)","v":13},13,1,1," - ","13",null,9,"9",16,"16",-23,"23"," - ",-52,"52"," - "," - ",null,null,0,null,"(3p + 4g)(4p - 13g) =","12p² - 23pg - 52g²",null,"(3p + 4g)² =","9p² + 24pg + 16g²",null,"(3p + 4g)(3p - 4g) =","9p² - 16g²",null,"(3p + 4g)(4p - 13g) =","12p² - 23pg - 52g²"]
[68,105,"i",106,106,"j",2,0,"","2",7,0,"","7",5,5,5,5,5,5,5,1," - ","5",9,0,"","9",8,9,9,9,9,9,9,1,1," - ","9",null,49,"49",25,"25",-73,"73"," - ",45,"45"," + "," + ",null,null,6,null,"(7i - 5j)(2i - 9j) =","14i² - 73ij + 45j²",null,"(7i - 5j)² =","49i² - 70ij + 25j²",null,"(7i - 5j)(7i + 5j) =","49i² - 25j²",null,"(7i - 5j)(7i + 5j) =","49i² - 25j²"]
[69,114,"r",117,117,"u",1,0,"","",2,0,"","2",7,7,7,7,7,7,7,0," + ","7",4,0,"","4",10,10,10,10,10,10,10,0,0," + ","10",null,4,"4",49,"49",27,"27"," + ",70,"70"," + "," - ",null,null,3,null,"(2r + 7u)(r + 10u) =","2r² + 27ru + 70u²",null,"(2r + 7u)² =","4r² + 28ru + 49u²",null,"(2r + 7u)(2r - 7u) =","4r² - 49u²",null,"(2r + 7u)² =","4r² + 28ru + 49u²"]
[70,118,"v",114,114,"r",8,0,"","8",8,0,"","8",6,7,7,7,7,7,7,1," - ","7",5,0,"","5",11,11,11,11,11,11,11,1,1," - ","11",null,64,"64",49,"49",-144,"144"," - ",77,"77"," + "," + ",null,null,6,null,"(8v - 7r)(8v - 11r) =","64v² - 144vr + 77r²",null,"(8v - 7r)² =","64v² - 112vr + 49r²",null,"(8v - 7r)(8v + 7r) =","64v² - 49r²",null,"(8v - 7r)(8v + 7r) =","64v² - 49r²"]
[71,98,"b",110,110,"n",8,0,"","8",5,0,"","5",3,3,3,3,3,3,3,1," - ","3",6,0,"","6",5,5,5,5,5,5,5,1,1," - ","5",null,25,"25",9,"9",-49,"49"," - ",15,"15"," + "," + ",null,null,0,null,"(5b - 3n)(8b - 5n) =","40b² - 49bn + 15n²",null,"(5b - 3n)² =","25b² - 30bn + 9n²",null,"(5b - 3n)(5b + 3n) =","25b² - 9n²",null,"(5b - 3n)(8b - 5n) =","40b² - 49bn + 15n²"]
[72,112,"p",99,99,"c",5,0,"","5",8,0,"","8",7,7,7,7,7,7,7,1," - ","7",7,0,"","7",10,10,10,10,11,11,11,0,0," + ","11",null,64,"64",49,"49",53,"53"," + ",-77,"77"," - "," + ",null,null,0,null,"(8p - 7c)(5p + 11c) =","40p² + 53pc - 77c²",null,"(8p - 7c)² =","64p² - 112pc + 49c²",null,"(8p - 7c)(8p + 7c) =","64p² - 49c²",null,"(8p - 7c)(5p + 11c) =","40p² + 53pc - 77c²"]
[73,118,"v",102,102,"f",2,0,"","2",9,0,"","9",3,3,4,4,4,4,4,1," - ","4",9,0,"","9",7,7,7,7,7,7,7,1,1," - ","7",null,81,"81",16,"16",-71,"71"," - ",28,"28"," + "," + ",null,null,3,null,"(9v - 4f)(2v - 7f) =","18v² - 71vf + 28f²",null,"(9v - 4f)² =","81v² - 72vf + 16f²",null,"(9v - 4f)(9v + 4f) =","81v² - 16f²",null,"(9v - 4f)² =","81v² - 72vf + 16f²"]
[74,101,"e",108,108,"m",4,0,"","4",2,0,"","2",6,7,7,7,7,7,7,0," + ","7",4,0,"","4",5,5,5,5,5,5,5,0,0," + ","5",null,4,"4",49,"49",38,"38"," + ",35,"35"," + "," - ",null,null,6,null,"(2e + 7m)(4e + 5m) =","8e² + 38em + 35m²",null,"(2e + 7m)² =","4e² + 28em + 49m²",null,"(2e + 7m)(2e - 7m) =","4e² - 49m²",null,"(2e + 7m)(2e - 7m) =","4e² - 49m²"]
[75,99,"c",115,115,"s",2,0,"","2",4,0,"","4",7,7,7,7,7,7,7,0," + ","7",4,0,"","4",9,9,9,9,9,9,9,0,0," + ","9",null,16,"16",49,"49",50,"50"," + ",63,"63"," + "," - ",null,null,3,null,"(4c + 7s)(2c + 9s) =","8c² + 50cs + 63s²",null,"(4c + 7s)² =","16c² + 56cs + 49s²",null,"(4c + 7s)(4c - 7s) =","16c² - 49s²",null,"(4c + 7s)² =","16c² + 56cs + 49s²"]

{"sheet":"Worksheet","index":2,"n_rows":28,"n_cols":6,"rows_kept":28,"cut":false,"hidden":false,"merged":[]}
[null,null,null,"BINOMIAL EXPANSIONS"]
[null,null,null,null,{"$f":"CONCATENATE(\"Worksheet \",Working!D1,Working!C1)","v":"Worksheet QT-899"}]
["Expand the following;"]
[{"$f":"CONCATENATE(Working!$A3,\")\")","v":"1)"},{"$f":"(Working!$BM3)","v":"(2m + 3)(m + 7) ="},{"$f":"CONCATENATE(Working!$A28,\")\")","v":"26)"},{"$f":"(Working!$BM28)","v":"(2n - 1)(2n - 5) ="},{"$f":"CONCATENATE(Working!$A53,\")\")","v":"51)"},{"$f":"(Working!$BM53)","v":"(3i - 5c)(9i - 4c) ="}]
[{"$f":"CONCATENATE(Working!$A4,\")\")","v":"2)"},{"$f":"(Working!$BM4)","v":"(4s + 5)² ="},{"$f":"CONCATENATE(Working!$A29,\")\")","v":"27)"},{"$f":"(Working!$BM29)","v":"(7d + 2)(4d + 9) ="},{"$f":"CONCATENATE(Working!$A54,\")\")","v":"52)"},{"$f":"(Working!$BM54)","v":"(9u + 7a)(9u - 7a) ="}]
[{"$f":"CONCATENATE(Working!$A5,\")\")","v":"3)"},{"$f":"(Working!$BM5)","v":"(3v + 1)(3v - 1) ="},{"$f":"CONCATENATE(Working!$A30,\")\")","v":"28)"},{"$f":"(Working!$BM30)","v":"(8s + 3)² ="},{"$f":"CONCATENATE(Working!$A55,\")\")","v":"53)"},{"$f":"(Working!$BM55)","v":"(7k + 4s)² ="}]
[{"$f":"CONCATENATE(Working!$A6,\")\")","v":"4)"},{"$f":"(Working!$BM6)","v":"(2c + 1)(2c - 1) ="},{"$f":"CONCATENATE(Working!$A31,\")\")","v":"29)"},{"$f":"(Working!$BM31)","v":"(2s + 7)(2s - 7) ="},{"$f":"CONCATENATE(Working!$A56,\")\")","v":"54)"},{"$f":"(Working!$BM56)","v":"(8b - 3m)² ="}]
[{"$f":"CONCATENATE(Working!$A7,\")\")","v":"5)"},{"$f":"(Working!$BM7)","v":"(3o + 4)(3o - 4) ="},{"$f":"CONCATENATE(Working!$A32,\")\")","v":"30)"},{"$f":"(Working!$BM32)","v":"(9v - 4)(9v + 4) ="},{"$f":"CONCATENATE(Working!$A57,\")\")","v":"55)"},{"$f":"(Working!$BM57)","v":"(3e - q)² ="}]
[{"$f":"CONCATENATE(Working!$A8,\")\")","v":"6)"},{"$f":"(Working!$BM8)","v":"(2f + 5)(2f - 5) ="},{"$f":"CONCATENATE(Working!$A33,\")\")","v":"31)"},{"$f":"(Working!$BM33)","v":"(9b + 4)(6b + 5) ="},{"$f":"CONCATENATE(Working!$A58,\")\")","v":"56)"},{"$f":"(Working!$BM58)","v":"(6i - 7b)(6i + 7b) ="}]
[{"$f":"CONCATENATE(Working!$A9,\")\")","v":"7)"},{"$f":"(Working!$BM9)","v":"(4j + 1)² ="},{"$f":"CONCATENATE(Working!$A34,\")\")","v":"32)"},{"$f":"(Working!$BM34)","v":"(2x + 5)(3x - 4) ="},{"$f":"CONCATENATE(Working!$A59,\")\")","v":"57)"},{"$f":"(Working!$BM59)","v":"(6u + 5h)² ="}]
[{"$f":"CONCATENATE(Working!$A10,\")\")","v":"8)"},{"$f":"(Working!$BM10)","v":"(5m + 2)(3m + 4) ="},{"$f":"CONCATENATE(Working!$A35,\")\")","v":"33)"},{"$f":"(Working!$BM35)","v":"(9x + 4)(9x - 4) ="},{"$f":"CONCATENATE(Working!$A60,\")\")","v":"58)"},{"$f":"(Working!$BM60)","v":"(q - o)² ="}]
[{"$f":"CONCATENATE(Working!$A11,\")\")","v":"9)"},{"$f":"(Working!$BM11)","v":"(5v + 2)(5v - 2) ="},{"$f":"CONCATENATE(Working!$A36,\")\")","v":"34)"},{"$f":"(Working!$BM36)","v":"(7q - 8)(7q + 8) ="},{"$f":"CONCATENATE(Working!$A61,\")\")","v":"59)"},{"$f":"(Working!$BM61)","v":"(2n + 5m)(4n - m) ="}]
[{"$f":"CONCATENATE(Working!$A12,\")\")","v":"10)"},{"$f":"(Working!$BM12)","v":"(5b + 2)² ="},{"$f":"CONCATENATE(Working!$A37,\")\")","v":"35)"},{"$f":"(Working!$BM37)","v":"(2j - 3)² ="},{"$f":"CONCATENATE(Working!$A62,\")\")","v":"60)"},{"$f":"(Working!$BM62)","v":"(8p - 5e)² ="}]
[{"$f":"CONCATENATE(Working!$A13,\")\")","v":"11)"},{"$f":"(Working!$BM13)","v":"(3c - 4)² ="},{"$f":"CONCATENATE(Working!$A38,\")\")","v":"36)"},{"$f":"(Working!$BM38)","v":"(6b - 1)(6b + 1) ="},{"$f":"CONCATENATE(Working!$A63,\")\")","v":"61)"},{"$f":"(Working!$BM63)","v":"(6a - 5x)(6a - 5x) ="}]
[{"$f":"CONCATENATE(Working!$A14,\")\")","v":"12)"},{"$f":"(Working!$BM14)","v":"(3f - 2)(2f - 9) ="},{"$f":"CONCATENATE(Working!$A39,\")\")","v":"37)"},{"$f":"(Working!$BM39)","v":"(9v - 2)(8v - 11) ="},{"$f":"CONCATENATE(Working!$A64,\")\")","v":"62)"},{"$f":"(Working!$BM64)","v":"(9q - 5e)² ="}]
[{"$f":"CONCATENATE(Working!$A15,\")\")","v":"13)"},{"$f":"(Working!$BM15)","v":"(3r - 2)(3r + 2) ="},{"$f":"CONCATENATE(Working!$A40,\")\")","v":"38)"},{"$f":"(Working!$BM40)","v":"(7c + 4)² ="},{"$f":"CONCATENATE(Working!$A65,\")\")","v":"63)"},{"$f":"(Working!$BM65)","v":"(4g - 3s)(4g + 3s) ="}]
[{"$f":"CONCATENATE(Working!$A16,\")\")","v":"14)"},{"$f":"(Working!$BM16)","v":"(4s - 5)(s - 7) ="},{"$f":"CONCATENATE(Working!$A41,\")\")","v":"39)"},{"$f":"(Working!$BM41)","v":"(3i - 2)(3i + 2) ="},{"$f":"CONCATENATE(Working!$A66,\")\")","v":"64)"},{"$f":"(Working!$BM66)","v":"(2p + 5d)(2p - 5d) ="}]
[{"$f":"CONCATENATE(Working!$A17,\")\")","v":"15)"},{"$f":"(Working!$BM17)","v":"(2c - 1)² ="},{"$f":"CONCATENATE(Working!$A42,\")\")","v":"40)"},{"$f":"(Working!$BM42)","v":"(4t + 7)(4t - 7) ="},{"$f":"CONCATENATE(Working!$A67,\")\")","v":"65)"},{"$f":"(Working!$BM67)","v":"(8x + 3f)(3x - f) ="}]
[{"$f":"CONCATENATE(Working!$A18,\")\")","v":"16)"},{"$f":"(Working!$BM18)","v":"(5t - 3)(5t + 3) ="},{"$f":"CONCATENATE(Working!$A43,\")\")","v":"41)"},{"$f":"(Working!$BM43)","v":"(7n + 4)² ="},{"$f":"CONCATENATE(Working!$A68,\")\")","v":"66)"},{"$f":"(Working!$BM68)","v":"(3k - 4g)(3k + 4g) ="}]
[{"$f":"CONCATENATE(Working!$A19,\")\")","v":"17)"},{"$f":"(Working!$BM19)","v":"(5j - 4)(5j + 4) ="},{"$f":"CONCATENATE(Working!$A44,\")\")","v":"42)"},{"$f":"(Working!$BM44)","v":"(6d - 5)(6d + 5) ="},{"$f":"CONCATENATE(Working!$A69,\")\")","v":"67)"},{"$f":"(Working!$BM69)","v":"(3p + 4g)(4p - 13g) ="}]
[{"$f":"CONCATENATE(Working!$A20,\")\")","v":"18)"},{"$f":"(Working!$BM20)","v":"(3a - 1)(a - 5) ="},{"$f":"CONCATENATE(Working!$A45,\")\")","v":"43)"},{"$f":"(Working!$BM45)","v":"(8h - 5)² ="},{"$f":"CONCATENATE(Working!$A70,\")\")","v":"68)"},{"$f":"(Working!$BM70)","v":"(7i - 5j)(7i + 5j) ="}]
[{"$f":"CONCATENATE(Working!$A21,\")\")","v":"19)"},{"$f":"(Working!$BM21)","v":"(3t - 2)² ="},{"$f":"CONCATENATE(Working!$A46,\")\")","v":"44)"},{"$f":"(Working!$BM46)","v":"(8r + 7)(8r - 7) ="},{"$f":"CONCATENATE(Working!$A71,\")\")","v":"69)"},{"$f":"(Working!$BM71)","v":"(2r + 7u)² ="}]
[{"$f":"CONCATENATE(Working!$A22,\")\")","v":"20)"},{"$f":"(Working!$BM22)","v":"(4u - 3)² ="},{"$f":"CONCATENATE(Working!$A47,\")\")","v":"45)"},{"$f":"(Working!$BM47)","v":"(4a - 5)² ="},{"$f":"CONCATENATE(Working!$A72,\")\")","v":"70)"},{"$f":"(Working!$BM72)","v":"(8v - 7r)(8v + 7r) ="}]
[{"$f":"CONCATENATE(Working!$A23,\")\")","v":"21)"},{"$f":"(Working!$BM23)","v":"(5s - 3)² ="},{"$f":"CONCATENATE(Working!$A48,\")\")","v":"46)"},{"$f":"(Working!$BM48)","v":"(6k + 7)(3k + 7) ="},{"$f":"CONCATENATE(Working!$A73,\")\")","v":"71)"},{"$f":"(Working!$BM73)","v":"(5b - 3n)(8b - 5n) ="}]
[{"$f":"CONCATENATE(Working!$A24,\")\")","v":"22)"},{"$f":"(Working!$BM24)","v":"(2o - 1)(2o + 1) ="},{"$f":"CONCATENATE(Working!$A49,\")\")","v":"47)"},{"$f":"(Working!$BM49)","v":"(8w + 3)(8w - 3) ="},{"$f":"CONCATENATE(Working!$A74,\")\")","v":"72)"},{"$f":"(Working!$BM74)","v":"(8p - 7c)(5p + 11c) ="}]
[{"$f":"CONCATENATE(Working!$A25,\")\")","v":"23)"},{"$f":"(Working!$BM25)","v":"(5m - 3)² ="},{"$f":"CONCATENATE(Working!$A50,\")\")","v":"48)"},{"$f":"(Working!$BM50)","v":"(5a - 4)(5a + 4) ="},{"$f":"CONCATENATE(Working!$A75,\")\")","v":"73)"},{"$f":"(Working!$BM75)","v":"(9v - 4f)² ="}]
[{"$f":"CONCATENATE(Working!$A26,\")\")","v":"24)"},{"$f":"(Working!$BM26)","v":"(3b + 2)(2b - 3) ="},{"$f":"CONCATENATE(Working!$A51,\")\")","v":"49)"},{"$f":"(Working!$BM51)","v":"(6n + 5)(6n - 5) ="},{"$f":"CONCATENATE(Working!$A76,\")\")","v":"74)"},{"$f":"(Working!$BM76)","v":"(2e + 7m)(2e - 7m) ="}]
[{"$f":"CONCATENATE(Working!$A27,\")\")","v":"25)"},{"$f":"(Working!$BM27)","v":"(2e + 1)(e + 3) ="},{"$f":"CONCATENATE(Working!$A52,\")\")","v":"50)"},{"$f":"(Working!$BM52)","v":"(7i + 1)(7i - 12) ="},{"$f":"CONCATENATE(Working!$A77,\")\")","v":"75)"},{"$f":"(Working!$BM77)","v":"(4c + 7s)² ="}]

{"sheet":"Answers","index":3,"n_rows":28,"n_cols":7,"rows_kept":28,"cut":false,"hidden":false,"merged":[]}
[null,null,null,"BINOMIAL EXPANSIONS"]
[null,null,null,"Answers",null,null,{"$f":"CONCATENATE(\"Worksheet \",Working!D1,Working!C1)","v":"Worksheet QT-899"}]
[]
[{"$f":"CONCATENATE(Working!$A3,\")\")","v":"1)"},{"$f":"Working!$BN3","v":"2m² + 17m + 21"},{"$f":"CONCATENATE(Working!$A28,\")\")","v":"26)"},{"$f":"Working!$BN28","v":"4n² - 12n + 5"},{"$f":"CONCATENATE(Working!$A53,\")\")","v":"51)"},{"$f":"Working!$BN53","v":"27i² - 57ic + 20c²"}]
[{"$f":"CONCATENATE(Working!$A4,\")\")","v":"2)"},{"$f":"Working!$BN4","v":"16s² + 40s + 25"},{"$f":"CONCATENATE(Working!$A29,\")\")","v":"27)"},{"$f":"Working!$BN29","v":"28d² + 71d + 18"},{"$f":"CONCATENATE(Working!$A54,\")\")","v":"52)"},{"$f":"Working!$BN54","v":"81u² - 49a²"}]
[{"$f":"CONCATENATE(Working!$A5,\")\")","v":"3)"},{"$f":"Working!$BN5","v":"9v² - 1"},{"$f":"CONCATENATE(Working!$A30,\")\")","v":"28)"},{"$f":"Working!$BN30","v":"64s² + 48s + 9"},{"$f":"CONCATENATE(Working!$A55,\")\")","v":"53)"},{"$f":"Working!$BN55","v":"49k² + 56ks + 16s²"}]
[{"$f":"CONCATENATE(Working!$A6,\")\")","v":"4)"},{"$f":"Working!$BN6","v":"4c² - 1"},{"$f":"CONCATENATE(Working!$A31,\")\")","v":"29)"},{"$f":"Working!$BN31","v":"4s² - 49"},{"$f":"CONCATENATE(Working!$A56,\")\")","v":"54)"},{"$f":"Working!$BN56","v":"64b² - 48bm + 9m²"}]
[{"$f":"CONCATENATE(Working!$A7,\")\")","v":"5)"},{"$f":"Working!$BN7","v":"9o² - 16"},{"$f":"CONCATENATE(Working!$A32,\")\")","v":"30)"},{"$f":"Working!$BN32","v":"81v² - 16"},{"$f":"CONCATENATE(Working!$A57,\")\")","v":"55)"},{"$f":"Working!$BN57","v":"9e² - 6eq + q²"}]
[{"$f":"CONCATENATE(Working!$A8,\")\")","v":"6)"},{"$f":"Working!$BN8","v":"4f² - 25"},{"$f":"CONCATENATE(Working!$A33,\")\")","v":"31)"},{"$f":"Working!$BN33","v":"54b² + 69b + 20"},{"$f":"CONCATENATE(Working!$A58,\")\")","v":"56)"},{"$f":"Working!$BN58","v":"36i² - 49b²"}]
[{"$f":"CONCATENATE(Working!$A9,\")\")","v":"7)"},{"$f":"Working!$BN9","v":"16j² + 8j + 1"},{"$f":"CONCATENATE(Working!$A34,\")\")","v":"32)"},{"$f":"Working!$BN34","v":"6x² + 7x - 20"},{"$f":"CONCATENATE(Working!$A59,\")\")","v":"57)"},{"$f":"Working!$BN59","v":"36u² + 60uh + 25h²"}]
[{"$f":"CONCATENATE(Working!$A10,\")\")","v":"8)"},{"$f":"Working!$BN10","v":"15m² + 26m + 8"},{"$f":"CONCATENATE(Working!$A35,\")\")","v":"33)"},{"$f":"Working!$BN35","v":"81x² - 16"},{"$f":"CONCATENATE(Working!$A60,\")\")","v":"58)"},{"$f":"Working!$BN60","v":"q² - 2qo + o²"}]
[{"$f":"CONCATENATE(Working!$A11,\")\")","v":"9)"},{"$f":"Working!$BN11","v":"25v² - 4"},{"$f":"CONCATENATE(Working!$A36,\")\")","v":"34)"},{"$f":"Working!$BN36","v":"49q² - 64"},{"$f":"CONCATENATE(Working!$A61,\")\")","v":"59)"},{"$f":"Working!$BN61","v":"8n² + 18nm - 5m²"}]
[{"$f":"CONCATENATE(Working!$A12,\")\")","v":"10)"},{"$f":"Working!$BN12","v":"25b² + 20b + 4"},{"$f":"CONCATENATE(Working!$A37,\")\")","v":"35)"},{"$f":"Working!$BN37","v":"4j² - 12j + 9"},{"$f":"CONCATENATE(Working!$A62,\")\")","v":"60)"},{"$f":"Working!$BN62","v":"64p² - 80pe + 25e²"}]
[{"$f":"CONCATENATE(Working!$A13,\")\")","v":"11)"},{"$f":"Working!$BN13","v":"9c² - 24c + 16"},{"$f":"CONCATENATE(Working!$A38,\")\")","v":"36)"},{"$f":"Working!$BN38","v":"36b² - 1"},{"$f":"CONCATENATE(Working!$A63,\")\")","v":"61)"},{"$f":"Working!$BN63","v":"36a² - 60ax + 25x²"}]
[{"$f":"CONCATENATE(Working!$A14,\")\")","v":"12)"},{"$f":"Working!$BN14","v":"6f² - 31f + 18"},{"$f":"CONCATENATE(Working!$A39,\")\")","v":"37)"},{"$f":"Working!$BN39","v":"72v² - 115v + 22"},{"$f":"CONCATENATE(Working!$A64,\")\")","v":"62)"},{"$f":"Working!$BN64","v":"81q² - 90qe + 25e²"}]
[{"$f":"CONCATENATE(Working!$A15,\")\")","v":"13)"},{"$f":"Working!$BN15","v":"9r² - 4"},{"$f":"CONCATENATE(Working!$A40,\")\")","v":"38)"},{"$f":"Working!$BN40","v":"49c² + 56c + 16"},{"$f":"CONCATENATE(Working!$A65,\")\")","v":"63)"},{"$f":"Working!$BN65","v":"16g² - 9s²"}]
[{"$f":"CONCATENATE(Working!$A16,\")\")","v":"14)"},{"$f":"Working!$BN16","v":"4s² - 33s + 35"},{"$f":"CONCATENATE(Working!$A41,\")\")","v":"39)"},{"$f":"Working!$BN41","v":"9i² - 4"},{"$f":"CONCATENATE(Working!$A66,\")\")","v":"64)"},{"$f":"Working!$BN66","v":"4p² - 25d²"}]
[{"$f":"CONCATENATE(Working!$A17,\")\")","v":"15)"},{"$f":"Working!$BN17","v":"4c² - 4c + 1"},{"$f":"CONCATENATE(Working!$A42,\")\")","v":"40)"},{"$f":"Working!$BN42","v":"16t² - 49"},{"$f":"CONCATENATE(Working!$A67,\")\")","v":"65)"},{"$f":"Working!$BN67","v":"24x² + xf - 3f²"}]
[{"$f":"CONCATENATE(Working!$A18,\")\")","v":"16)"},{"$f":"Working!$BN18","v":"25t² - 9"},{"$f":"CONCATENATE(Working!$A43,\")\")","v":"41)"},{"$f":"Working!$BN43","v":"49n² + 56n + 16"},{"$f":"CONCATENATE(Working!$A68,\")\")","v":"66)"},{"$f":"Working!$BN68","v":"9k² - 16g²"}]
[{"$f":"CONCATENATE(Working!$A19,\")\")","v":"17)"},{"$f":"Working!$BN19","v":"25j² - 16"},{"$f":"CONCATENATE(Working!$A44,\")\")","v":"42)"},{"$f":"Working!$BN44","v":"36d² - 25"},{"$f":"CONCATENATE(Working!$A69,\")\")","v":"67)"},{"$f":"Working!$BN69","v":"12p² - 23pg - 52g²"}]
[{"$f":"CONCATENATE(Working!$A20,\")\")","v":"18)"},{"$f":"Working!$BN20","v":"3a² - 16a + 5"},{"$f":"CONCATENATE(Working!$A45,\")\")","v":"43)"},{"$f":"Working!$BN45","v":"64h² - 80h + 25"},{"$f":"CONCATENATE(Working!$A70,\")\")","v":"68)"},{"$f":"Working!$BN70","v":"49i² - 25j²"}]
[{"$f":"CONCATENATE(Working!$A21,\")\")","v":"19)"},{"$f":"Working!$BN21","v":"9t² - 12t + 4"},{"$f":"CONCATENATE(Working!$A46,\")\")","v":"44)"},{"$f":"Working!$BN46","v":"64r² - 49"},{"$f":"CONCATENATE(Working!$A71,\")\")","v":"69)"},{"$f":"Working!$BN71","v":"4r² + 28ru + 49u²"}]
[{"$f":"CONCATENATE(Working!$A22,\")\")","v":"20)"},{"$f":"Working!$BN22","v":"16u² - 24u + 9"},{"$f":"CONCATENATE(Working!$A47,\")\")","v":"45)"},{"$f":"Working!$BN47","v":"16a² - 40a + 25"},{"$f":"CONCATENATE(Working!$A72,\")\")","v":"70)"},{"$f":"Working!$BN72","v":"64v² - 49r²"}]
[{"$f":"CONCATENATE(Working!$A23,\")\")","v":"21)"},{"$f":"Working!$BN23","v":"25s² - 30s + 9"},{"$f":"CONCATENATE(Working!$A48,\")\")","v":"46)"},{"$f":"Working!$BN48","v":"18k² + 63k + 49"},{"$f":"CONCATENATE(Working!$A73,\")\")","v":"71)"},{"$f":"Working!$BN73","v":"40b² - 49bn + 15n²"}]
[{"$f":"CONCATENATE(Working!$A24,\")\")","v":"22)"},{"$f":"Working!$BN24","v":"4o² - 1"},{"$f":"CONCATENATE(Working!$A49,\")\")","v":"47)"},{"$f":"Working!$BN49","v":"64w² - 9"},{"$f":"CONCATENATE(Working!$A74,\")\")","v":"72)"},{"$f":"Working!$BN74","v":"40p² + 53pc - 77c²"}]
[{"$f":"CONCATENATE(Working!$A25,\")\")","v":"23)"},{"$f":"Working!$BN25","v":"25m² - 30m + 9"},{"$f":"CONCATENATE(Working!$A50,\")\")","v":"48)"},{"$f":"Working!$BN50","v":"25a² - 16"},{"$f":"CONCATENATE(Working!$A75,\")\")","v":"73)"},{"$f":"Working!$BN75","v":"81v² - 72vf + 16f²"}]
[{"$f":"CONCATENATE(Working!$A26,\")\")","v":"24)"},{"$f":"Working!$BN26","v":"6b² - 5b - 6"},{"$f":"CONCATENATE(Working!$A51,\")\")","v":"49)"},{"$f":"Working!$BN51","v":"36n² - 25"},{"$f":"CONCATENATE(Working!$A76,\")\")","v":"74)"},{"$f":"Working!$BN76","v":"4e² - 49m²"}]
[{"$f":"CONCATENATE(Working!$A27,\")\")","v":"25)"},{"$f":"Working!$BN27","v":"2e² + 7e + 3"},{"$f":"CONCATENATE(Working!$A52,\")\")","v":"50)"},{"$f":"Working!$BN52","v":"49i² - 77i - 12"},{"$f":"CONCATENATE(Working!$A77,\")\")","v":"75)"},{"$f":"Working!$BN77","v":"16c² + 56cs + 49s²"}]